BDBM50303556 (1-((Tetrahydrofuran-3-yl)methyl)-1H-indol-3-yl)(2,2,3,3-tetramethylcyclopropyl)methanone::CHEMBL569994
SMILES: CC1(C)C(C(=O)c2cn(CC3CCOC3)c3ccccc23)C1(C)C
InChI Key: InChIKey=RKJJVEGZZUFFPU-UHFFFAOYSA-N
Data: 2 KI  1 EC50
Activity Spreadsheet -- Enzyme Inhibition Constant Data from BindingDB
Found 3 hits for monomerid = 50303556
Trg + Lig
Ki
nM
ΔG°
kcal/mole
IC50
nM
Kd
nM
EC50/IC50
nM
koff
s-1
kon
M-1s-1
pHTemp
°C
Cannabinoid receptor 2
(Homo sapiens (Human))
BDBM50303556
((1-((Tetrahydrofuran-3-yl)methyl)-1H-indol-3-yl)(2...)
Show SMILES CC1(C)C(C(=O)c2cn(CC3CCOC3)c3ccccc23)C1(C)C
Show InChI InChI=1S/C21H27NO2/c1-20(2)19(21(20,3)4)18(23)16-12-22(11-14-9-10-24-13-14)17-8-6-5-7-15(16)17/h5-8,12,14,19H,9-11,13H2,1-4H3
Reactome pathway
0.140n/an/an/an/an/an/an/an/a
Abbott Laboratories
Curated by ChEMBL
Assay Description
Displacement of [3H]CP-55940 from human recombinant CB2 receptor expressed in HEK293 cells
J Med Chem 53: 295-315 (2010)
Article DOI: 10.1021/jm901214q
BindingDB Entry DOI: 10.7270/Q2KD1Z00
Cannabinoid receptor 1
(Homo sapiens (Human))
BDBM50303556
((1-((Tetrahydrofuran-3-yl)methyl)-1H-indol-3-yl)(2...)
Show SMILES CC1(C)C(C(=O)c2cn(CC3CCOC3)c3ccccc23)C1(C)C
Show InChI InChI=1S/C21H27NO2/c1-20(2)19(21(20,3)4)18(23)16-12-22(11-14-9-10-24-13-14)17-8-6-5-7-15(16)17/h5-8,12,14,19H,9-11,13H2,1-4H3
NCI pathway
Reactome pathway
630n/an/an/an/an/an/an/an/a
Abbott Laboratories
Curated by ChEMBL
Assay Description
Displacement of [3H]CP-55940 from human recombinant CB1 receptor expressed in CHO cells
J Med Chem 53: 295-315 (2010)
Article DOI: 10.1021/jm901214q
BindingDB Entry DOI: 10.7270/Q2KD1Z00
Cannabinoid receptor 2
(Homo sapiens (Human))
BDBM50303556
((1-((Tetrahydrofuran-3-yl)methyl)-1H-indol-3-yl)(2...)
Show SMILES CC1(C)C(C(=O)c2cn(CC3CCOC3)c3ccccc23)C1(C)C
Show InChI InChI=1S/C21H27NO2/c1-20(2)19(21(20,3)4)18(23)16-12-22(11-14-9-10-24-13-14)17-8-6-5-7-15(16)17/h5-8,12,14,19H,9-11,13H2,1-4H3
Reactome pathway
n/an/an/an/a 6n/an/an/an/a
Abbott Laboratories
Curated by ChEMBL
Assay Description
Agonist activity at human recombinant CB2 receptor expressed in HEK293 cells coexpressing Galphaq/o5 assessed as calcium mobilization by FLIPR assay
J Med Chem 53: 295-315 (2010)
Article DOI: 10.1021/jm901214q
BindingDB Entry DOI: 10.7270/Q2KD1Z00