BDBM50303585 1-(3-tert-butyl-1-(3-nitrophenyl)-1H-pyrazol-5-yl)-3-(4-chlorophenyl)urea::CHEMBL583263
SMILES: CC(C)(C)c1cc(NC(=O)Nc2ccc(Cl)cc2)n(n1)-c1cccc(c1)[N+]([O-])=O
InChI Key: InChIKey=QMJQHTTXRJIVJD-UHFFFAOYSA-N
Data: 3 IC50  1 Kd
Activity Spreadsheet -- Enzyme Inhibition Constant Data from BindingDB
Found 4 hits for monomerid = 50303585
Trg + Lig
Ki
nM
ΔG°
kcal/mole
IC50
nM
Kd
nM
EC50/IC50
nM
koff
s-1
kon
M-1s-1
pHTemp
°C
Discoidin domain-containing receptor 2
(Homo sapiens (Human))
BDBM50303585
(1-(3-tert-butyl-1-(3-nitrophenyl)-1H-pyrazol-5-yl)...)
Show SMILES CC(C)(C)c1cc(NC(=O)Nc2ccc(Cl)cc2)n(n1)-c1cccc(c1)[N+]([O-])=O
Show InChI InChI=1S/C20H20ClN5O3/c1-20(2,3)17-12-18(23-19(27)22-14-9-7-13(21)8-10-14)25(24-17)15-5-4-6-16(11-15)26(28)29/h4-12H,1-3H3,(H2,22,23,27)
Reactome pathway
n/an/a 856n/an/an/an/an/an/a
Technical University of Dortmund
Curated by ChEMBL
Assay Description
Inhibition of wild type DDR2 (unknown origin) preincubated for 30 mins before substrate addition by FRET assay
J Med Chem 57: 4252-62 (2014)
Article DOI: 10.1021/jm500167q
BindingDB Entry DOI: 10.7270/Q2Z039P4
Mitogen-activated protein kinase 14
(Homo sapiens (Human))
BDBM50303585
(1-(3-tert-butyl-1-(3-nitrophenyl)-1H-pyrazol-5-yl)...)
Show SMILES CC(C)(C)c1cc(NC(=O)Nc2ccc(Cl)cc2)n(n1)-c1cccc(c1)[N+]([O-])=O
Show InChI InChI=1S/C20H20ClN5O3/c1-20(2,3)17-12-18(23-19(27)22-14-9-7-13(21)8-10-14)25(24-17)15-5-4-6-16(11-15)26(28)29/h4-12H,1-3H3,(H2,22,23,27)
NCI pathway
Reactome pathway
n/an/a 220n/an/an/an/an/an/a
Chemical Genomics Centre of the Max Planck Society
Curated by ChEMBL
Assay Description
Displacemnt of N,N'-(2,2'-(3,3'-disulfanediylbis(2,5-dioxopyrrolidine-3,1-diyl))bis(ethane-2,1-diyl))bis(2-(3-(3-tert-butyl-5-(3-naphthalen-1-ylureid...
J Med Chem 53: 357-67 (2010)
Article DOI: 10.1021/jm901297e
BindingDB Entry DOI: 10.7270/Q29W0FKC
Mitogen-activated protein kinase 14
(Homo sapiens (Human))
BDBM50303585
(1-(3-tert-butyl-1-(3-nitrophenyl)-1H-pyrazol-5-yl)...)
Show SMILES CC(C)(C)c1cc(NC(=O)Nc2ccc(Cl)cc2)n(n1)-c1cccc(c1)[N+]([O-])=O
Show InChI InChI=1S/C20H20ClN5O3/c1-20(2,3)17-12-18(23-19(27)22-14-9-7-13(21)8-10-14)25(24-17)15-5-4-6-16(11-15)26(28)29/h4-12H,1-3H3,(H2,22,23,27)
NCI pathway
Reactome pathway
n/an/a 120n/an/an/an/an/an/a
Chemical Genomics Centre of the Max Planck Society
Curated by ChEMBL
Assay Description
Inhibition of p38alpha active form expressed in Escherichia coli BL21(DE3) cells by HTRF assay
J Med Chem 53: 357-67 (2010)
Article DOI: 10.1021/jm901297e
BindingDB Entry DOI: 10.7270/Q29W0FKC
Discoidin domain-containing receptor 2
(Homo sapiens (Human))
BDBM50303585
(1-(3-tert-butyl-1-(3-nitrophenyl)-1H-pyrazol-5-yl)...)
Show SMILES CC(C)(C)c1cc(NC(=O)Nc2ccc(Cl)cc2)n(n1)-c1cccc(c1)[N+]([O-])=O
Show InChI InChI=1S/C20H20ClN5O3/c1-20(2,3)17-12-18(23-19(27)22-14-9-7-13(21)8-10-14)25(24-17)15-5-4-6-16(11-15)26(28)29/h4-12H,1-3H3,(H2,22,23,27)
Reactome pathway
n/an/an/a 412n/an/an/an/an/a
Technical University of Dortmund
Curated by ChEMBL
Assay Description
Binding affinity to human acrylodan-labeled N-terminal His-tagged DDR2 (558 to 855 aa) by FLiK assay
J Med Chem 57: 4252-62 (2014)
Article DOI: 10.1021/jm500167q
BindingDB Entry DOI: 10.7270/Q2Z039P4