BDBM50303639 CHEMBL571626::N-(4-(2-(4-(1H-1,2,3-Triazol-1-yl)phenylamino)pyrimidin-4-yl)-phenyl)methanesulfonamide
SMILES: CS(=O)(=O)Nc1ccc(cc1)-c1ccnc(Nc2ccc(cc2)-n2ccnn2)n1
InChI Key: InChIKey=MDCMULVKRBERMG-UHFFFAOYSA-N
Data: 6 IC50
Activity Spreadsheet -- Enzyme Inhibition Constant Data from BindingDB
Found 6 hits for monomerid = 50303639
Trg + Lig
Ki
nM
ΔG°
kcal/mole
IC50
nM
Kd
nM
EC50/IC50
nM
koff
s-1
kon
M-1s-1
pHTemp
°C
MAP kinase p38
(Homo sapiens (Human))
BDBM50303639
(CHEMBL571626 | N-(4-(2-(4-(1H-1,2,3-Triazol-1-yl)p...)
Show SMILES CS(=O)(=O)Nc1ccc(cc1)-c1ccnc(Nc2ccc(cc2)-n2ccnn2)n1
Show InChI InChI=1S/C19H17N7O2S/c1-29(27,28)24-16-4-2-14(3-5-16)18-10-11-20-19(23-18)22-15-6-8-17(9-7-15)26-13-12-21-25-26/h2-13,24H,1H3,(H,20,22,23)
n/an/a>2.00E+4n/an/an/an/an/an/a
Eberhard Karls Universit£t T£bingen
Curated by ChEMBL
Assay Description
Inhibition of p38 (unknown origin)
J Med Chem 58: 72-95 (2015)
Article DOI: 10.1021/jm501212r
BindingDB Entry DOI: 10.7270/Q2JH3NVZ
Mitogen-activated protein kinase 10
(Rattus norvegicus)
BDBM50303639
(CHEMBL571626 | N-(4-(2-(4-(1H-1,2,3-Triazol-1-yl)p...)
Show SMILES CS(=O)(=O)Nc1ccc(cc1)-c1ccnc(Nc2ccc(cc2)-n2ccnn2)n1
Show InChI InChI=1S/C19H17N7O2S/c1-29(27,28)24-16-4-2-14(3-5-16)18-10-11-20-19(23-18)22-15-6-8-17(9-7-15)26-13-12-21-25-26/h2-13,24H,1H3,(H,20,22,23)
n/an/a 210n/an/an/an/an/an/a
Eberhard Karls Universit£t T£bingen
Curated by ChEMBL
Assay Description
Inhibition of JNK3-mediated c-jun phosphorylation in rat INS1 cells
J Med Chem 58: 72-95 (2015)
Article DOI: 10.1021/jm501212r
BindingDB Entry DOI: 10.7270/Q2JH3NVZ
Mitogen-activated protein kinase 10
(Homo sapiens (Human))
BDBM50303639
(CHEMBL571626 | N-(4-(2-(4-(1H-1,2,3-Triazol-1-yl)p...)
Show SMILES CS(=O)(=O)Nc1ccc(cc1)-c1ccnc(Nc2ccc(cc2)-n2ccnn2)n1
Show InChI InChI=1S/C19H17N7O2S/c1-29(27,28)24-16-4-2-14(3-5-16)18-10-11-20-19(23-18)22-15-6-8-17(9-7-15)26-13-12-21-25-26/h2-13,24H,1H3,(H,20,22,23)
NCI pathway
Reactome pathway
n/an/a 4n/an/an/an/an/an/a
and Translational Research Institute
Curated by ChEMBL
Assay Description
Inhibition of JNK3 by time resolved fluorescence assay
J Med Chem 53: 419-31 (2010)
Article DOI: 10.1021/jm901351f
BindingDB Entry DOI: 10.7270/Q23T9J6J
Mitogen-activated protein kinase 10
(Homo sapiens (Human))
BDBM50303639
(CHEMBL571626 | N-(4-(2-(4-(1H-1,2,3-Triazol-1-yl)p...)
Show SMILES CS(=O)(=O)Nc1ccc(cc1)-c1ccnc(Nc2ccc(cc2)-n2ccnn2)n1
Show InChI InChI=1S/C19H17N7O2S/c1-29(27,28)24-16-4-2-14(3-5-16)18-10-11-20-19(23-18)22-15-6-8-17(9-7-15)26-13-12-21-25-26/h2-13,24H,1H3,(H,20,22,23)
NCI pathway
Reactome pathway
n/an/a 4n/an/an/an/an/an/a
Eberhard Karls Universit£t T£bingen
Curated by ChEMBL
Assay Description
Inhibition of JNK3 (unknown origin) by time-resolved fluorescence assay
J Med Chem 58: 72-95 (2015)
Article DOI: 10.1021/jm501212r
BindingDB Entry DOI: 10.7270/Q2JH3NVZ
Mitogen-activated protein kinase 8
(Homo sapiens (Human))
BDBM50303639
(CHEMBL571626 | N-(4-(2-(4-(1H-1,2,3-Triazol-1-yl)p...)
Show SMILES CS(=O)(=O)Nc1ccc(cc1)-c1ccnc(Nc2ccc(cc2)-n2ccnn2)n1
Show InChI InChI=1S/C19H17N7O2S/c1-29(27,28)24-16-4-2-14(3-5-16)18-10-11-20-19(23-18)22-15-6-8-17(9-7-15)26-13-12-21-25-26/h2-13,24H,1H3,(H,20,22,23)
NCI pathway
Reactome pathway
n/an/a 16n/an/an/an/an/an/a
and Translational Research Institute
Curated by ChEMBL
Assay Description
Inhibition of JNK1 by time resolved fluorescence assay
J Med Chem 53: 419-31 (2010)
Article DOI: 10.1021/jm901351f
BindingDB Entry DOI: 10.7270/Q23T9J6J
Mitogen-activated protein kinase 8
(Homo sapiens (Human))
BDBM50303639
(CHEMBL571626 | N-(4-(2-(4-(1H-1,2,3-Triazol-1-yl)p...)
Show SMILES CS(=O)(=O)Nc1ccc(cc1)-c1ccnc(Nc2ccc(cc2)-n2ccnn2)n1
Show InChI InChI=1S/C19H17N7O2S/c1-29(27,28)24-16-4-2-14(3-5-16)18-10-11-20-19(23-18)22-15-6-8-17(9-7-15)26-13-12-21-25-26/h2-13,24H,1H3,(H,20,22,23)
NCI pathway
Reactome pathway
n/an/a 16n/an/an/an/an/an/a
Eberhard Karls Universit£t T£bingen
Curated by ChEMBL
Assay Description
Inhibition of JNK1 (unknown origin) by time-resolved fluorescence assay
J Med Chem 58: 72-95 (2015)
Article DOI: 10.1021/jm501212r
BindingDB Entry DOI: 10.7270/Q2JH3NVZ