BDBM50303804 (3aS,4R,9bR)-4-(6-bromobenzo[d][1,3]dioxol-5-yl)-3a,4,5,9b-tetrahydro-3H-cyclopenta[c]quinoline::CHEMBL583543::cid_3136844
SMILES: Brc1cc2OCOc2cc1[C@@H]1Nc2ccccc2[C@@H]2C=CC[C@H]12
InChI Key: InChIKey=YOLTZIVRJAPVPH-MJLGCCKJSA-N
Data: 1 KI  2 IC50  4 EC50
Activity Spreadsheet -- Enzyme Inhibition Constant Data from BindingDB
Found 7 hits for monomerid = 50303804
Trg + Lig
Ki
nM
ΔG°
kcal/mole
IC50
nM
Kd
nM
EC50/IC50
nM
koff
s-1
kon
M-1s-1
pHTemp
°C
Estrogen receptor
(Mus musculus)
BDBM50303804
((3aS,4R,9bR)-4-(6-bromobenzo[d][1,3]dioxol-5-yl)-3...)
Show SMILES Brc1cc2OCOc2cc1[C@@H]1Nc2ccccc2[C@@H]2C=CC[C@H]12 |r,c:22|
Show InChI InChI=1S/C19H16BrNO2/c20-15-9-18-17(22-10-23-18)8-14(15)19-13-6-3-5-11(13)12-4-1-2-7-16(12)21-19/h1-5,7-9,11,13,19,21H,6,10H2/t11-,13-,19+/m0/s1
0.300n/an/an/an/an/an/an/an/a
University of New Mexico Health Sciences Center
Curated by ChEMBL
Assay Description
Binding affinity to ERbeta receptor in mouse COS7 cells by competitive binding assay
Nat Chem Biol 5: 421-7 (2009)
Article DOI: 10.1038/nchembio.168
BindingDB Entry DOI: 10.7270/Q2RB74TZ
POsterior Segregation family member (pos-1)
(Caenorhabditis elegans)
BDBM50303804
((3aS,4R,9bR)-4-(6-bromobenzo[d][1,3]dioxol-5-yl)-3...)
Show SMILES Brc1cc2OCOc2cc1[C@@H]1Nc2ccccc2[C@@H]2C=CC[C@H]12 |r,c:22|
Show InChI InChI=1S/C19H16BrNO2/c20-15-9-18-17(22-10-23-18)8-14(15)19-13-6-3-5-11(13)12-4-1-2-7-16(12)21-19/h1-5,7-9,11,13,19,21H,6,10H2/t11-,13-,19+/m0/s1
PCBioAssay
n/an/an/an/a 3.00E+5n/an/an/an/a
Broad Institute
Curated by PubChem BioAssay
Assay Description
Broad Institute: MLPCN maternal gene expression Project ID: 2024 Keywords: Zinc finger, C. elegans, maternal gene expression, RNA-protein interac...
PubChem Bioassay (2009)
BindingDB Entry DOI: 10.7270/Q28G8J4C
RecName: Full=Zinc finger protein mex-5
(Caenorhabditis elegans)
BDBM50303804
((3aS,4R,9bR)-4-(6-bromobenzo[d][1,3]dioxol-5-yl)-3...)
Show SMILES Brc1cc2OCOc2cc1[C@@H]1Nc2ccccc2[C@@H]2C=CC[C@H]12 |r,c:22|
Show InChI InChI=1S/C19H16BrNO2/c20-15-9-18-17(22-10-23-18)8-14(15)19-13-6-3-5-11(13)12-4-1-2-7-16(12)21-19/h1-5,7-9,11,13,19,21H,6,10H2/t11-,13-,19+/m0/s1
PCBioAssay
n/an/an/an/a 3.00E+5n/an/an/an/a
Broad Institute
Curated by PubChem BioAssay
Assay Description
Broad Institute: MLPCN maternal gene expression Project ID: 2024 Keywords: Zinc finger, C. elegans, maternal gene expression, RNA-protein interac...
PubChem Bioassay (2009)
BindingDB Entry DOI: 10.7270/Q2D798VP
G-protein coupled estrogen receptor 1
(Homo sapiens (Human))
BDBM50303804
((3aS,4R,9bR)-4-(6-bromobenzo[d][1,3]dioxol-5-yl)-3...)
Show SMILES Brc1cc2OCOc2cc1[C@@H]1Nc2ccccc2[C@@H]2C=CC[C@H]12 |r,c:22|
Show InChI InChI=1S/C19H16BrNO2/c20-15-9-18-17(22-10-23-18)8-14(15)19-13-6-3-5-11(13)12-4-1-2-7-16(12)21-19/h1-5,7-9,11,13,19,21H,6,10H2/t11-,13-,19+/m0/s1
Reactome pathway
n/an/a 185n/an/an/an/an/an/a
University of New Mexico Health Sciences Center
Curated by ChEMBL
Assay Description
Antagonist activity at GPR30 in human SKBr3 cells assessed as inhibition of calcium mobilization
Nat Chem Biol 5: 421-7 (2009)
Article DOI: 10.1038/nchembio.168
BindingDB Entry DOI: 10.7270/Q2RB74TZ
G-protein coupled estrogen receptor 1
(Homo sapiens (Human))
BDBM50303804
((3aS,4R,9bR)-4-(6-bromobenzo[d][1,3]dioxol-5-yl)-3...)
Show SMILES Brc1cc2OCOc2cc1[C@@H]1Nc2ccccc2[C@@H]2C=CC[C@H]12 |r,c:22|
Show InChI InChI=1S/C19H16BrNO2/c20-15-9-18-17(22-10-23-18)8-14(15)19-13-6-3-5-11(13)12-4-1-2-7-16(12)21-19/h1-5,7-9,11,13,19,21H,6,10H2/t11-,13-,19+/m0/s1
Reactome pathway
n/an/a 20n/an/an/an/an/an/a
New Mexico State University
Curated by ChEMBL
Assay Description
Binding affinity to GPR30
J Med Chem 53: 1004-14 (2010)
Article DOI: 10.1021/jm9011802
BindingDB Entry DOI: 10.7270/Q2571C3V
Estrogen receptor
(Homo sapiens (Human))
BDBM50303804
((3aS,4R,9bR)-4-(6-bromobenzo[d][1,3]dioxol-5-yl)-3...)
Show SMILES Brc1cc2OCOc2cc1[C@@H]1Nc2ccccc2[C@@H]2C=CC[C@H]12 |r,c:22|
Show InChI InChI=1S/C19H16BrNO2/c20-15-9-18-17(22-10-23-18)8-14(15)19-13-6-3-5-11(13)12-4-1-2-7-16(12)21-19/h1-5,7-9,11,13,19,21H,6,10H2/t11-,13-,19+/m0/s1
PCBioAssay
n/an/an/an/a 782n/an/an/an/a
NMMLSC
Curated by PubChem BioAssay
Assay Description
University of New Mexico Assay Overview: Assay Support: 1X01 MH077627-01 Assay for Ligands of GPR30 and Classical Estrogen Receptors PI: Eric Prossni...
PubChem Bioassay (2008)
BindingDB Entry DOI: 10.7270/Q2HQ3XB9
streptokinase A precursor
(Streptococcus pyogenes M1 GAS)
BDBM50303804
((3aS,4R,9bR)-4-(6-bromobenzo[d][1,3]dioxol-5-yl)-3...)
Show SMILES Brc1cc2OCOc2cc1[C@@H]1Nc2ccccc2[C@@H]2C=CC[C@H]12 |r,c:22|
Show InChI InChI=1S/C19H16BrNO2/c20-15-9-18-17(22-10-23-18)8-14(15)19-13-6-3-5-11(13)12-4-1-2-7-16(12)21-19/h1-5,7-9,11,13,19,21H,6,10H2/t11-,13-,19+/m0/s1
PCBioAssay
n/an/an/an/a 2.55E+3n/an/an/an/a
Broad Institute
Curated by PubChem BioAssay
Assay Description
Keywords: Group A streptococcus, GAS, streptokinase, expression, virulence, inhibition, dose response, EC50 Assay Overview: The goal of this assa...
PubChem Bioassay (2009)
BindingDB Entry DOI: 10.7270/Q2736PBV