BDBM50303820 (R)-1-Cyclohexyl-1-((5aR,6S)-1-(4-fluorophenyl)-5a-methyl-5,5a,6,7,8,9-hexahydroimidazo[1,5-b]isoquinolin-6-yl)ethanol::CHEMBL572212
SMILES: C[C@@](O)(C1CCCCC1)[C@H]1CCCC2=Cc3c(ncn3C[C@]12C)-c1ccc(F)cc1
InChI Key: InChIKey=VKMOUZMRRMPZAB-AYRHNUGRSA-N
Data: 1 KI  1 IC50  3 EC50
Activity Spreadsheet -- Enzyme Inhibition Constant Data from BindingDB
Found 5 hits for monomerid = 50303820
Trg + Lig
Ki
nM
ΔG°
kcal/mole
IC50
nM
Kd
nM
EC50/IC50
nM
koff
s-1
kon
M-1s-1
pHTemp
°C
Glucocorticoid receptor
(Homo sapiens (Human))
BDBM50303820
((R)-1-Cyclohexyl-1-((5aR,6S)-1-(4-fluorophenyl)-5a...)
Show SMILES C[C@@](O)(C1CCCCC1)[C@H]1CCCC2=Cc3c(ncn3C[C@]12C)-c1ccc(F)cc1 |r,t:14|
Show InChI InChI=1S/C26H33FN2O/c1-25-16-29-17-28-24(18-11-13-21(27)14-12-18)22(29)15-20(25)9-6-10-23(25)26(2,30)19-7-4-3-5-8-19/h11-15,17,19,23,30H,3-10,16H2,1-2H3/t23-,25-,26+/m0/s1
3.10n/an/an/an/an/an/an/an/a
Bristol-Myers Squibb Company
Curated by ChEMBL
Assay Description
Displacement of GS-red from human glucocorticoid receptor by fluorescent polarization assay
J Med Chem 53: 1270-80 (2010)
Article DOI: 10.1021/jm901551w
BindingDB Entry DOI: 10.7270/Q2KS6SGW
Glucocorticoid receptor
(Homo sapiens (Human))
BDBM50303820
((R)-1-Cyclohexyl-1-((5aR,6S)-1-(4-fluorophenyl)-5a...)
Show SMILES C[C@@](O)(C1CCCCC1)[C@H]1CCCC2=Cc3c(ncn3C[C@]12C)-c1ccc(F)cc1 |r,t:14|
Show InChI InChI=1S/C26H33FN2O/c1-25-16-29-17-28-24(18-11-13-21(27)14-12-18)22(29)15-20(25)9-6-10-23(25)26(2,30)19-7-4-3-5-8-19/h11-15,17,19,23,30H,3-10,16H2,1-2H3/t23-,25-,26+/m0/s1
n/an/an/an/a 33n/an/an/an/a
Bristol-Myers Squibb Company
Curated by ChEMBL
Assay Description
Transrepression activity at glucocorticoid receptor expressed in human A549 cells assessed as inhibition of IL-1-beta-induced NF-kappaB dependent E-s...
J Med Chem 53: 1270-80 (2010)
Article DOI: 10.1021/jm901551w
BindingDB Entry DOI: 10.7270/Q2KS6SGW
Glucocorticoid receptor
(Homo sapiens (Human))
BDBM50303820
((R)-1-Cyclohexyl-1-((5aR,6S)-1-(4-fluorophenyl)-5a...)
Show SMILES C[C@@](O)(C1CCCCC1)[C@H]1CCCC2=Cc3c(ncn3C[C@]12C)-c1ccc(F)cc1 |r,t:14|
Show InChI InChI=1S/C26H33FN2O/c1-25-16-29-17-28-24(18-11-13-21(27)14-12-18)22(29)15-20(25)9-6-10-23(25)26(2,30)19-7-4-3-5-8-19/h11-15,17,19,23,30H,3-10,16H2,1-2H3/t23-,25-,26+/m0/s1
n/an/an/an/a 2n/an/an/an/a
Bristol-Myers Squibb Company
Curated by ChEMBL
Assay Description
Transrepression activity at glucocorticoid receptor expressed in human A549 cells assessed as inhibition of PMA-induced AP1 activity after 6 hrs by l...
J Med Chem 53: 1270-80 (2010)
Article DOI: 10.1021/jm901551w
BindingDB Entry DOI: 10.7270/Q2KS6SGW
Glucocorticoid receptor
(Homo sapiens (Human))
BDBM50303820
((R)-1-Cyclohexyl-1-((5aR,6S)-1-(4-fluorophenyl)-5a...)
Show SMILES C[C@@](O)(C1CCCCC1)[C@H]1CCCC2=Cc3c(ncn3C[C@]12C)-c1ccc(F)cc1 |r,t:14|
Show InChI InChI=1S/C26H33FN2O/c1-25-16-29-17-28-24(18-11-13-21(27)14-12-18)22(29)15-20(25)9-6-10-23(25)26(2,30)19-7-4-3-5-8-19/h11-15,17,19,23,30H,3-10,16H2,1-2H3/t23-,25-,26+/m0/s1
n/an/an/an/a 470n/an/an/an/a
Bristol-Myers Squibb Company
Curated by ChEMBL
Assay Description
Transactivation of GAL-4 tagged glucocorticoid receptor ligand binding domain expressed in human HeLa cells assessed as NP1 activation by luciferase ...
J Med Chem 53: 1270-80 (2010)
Article DOI: 10.1021/jm901551w
BindingDB Entry DOI: 10.7270/Q2KS6SGW
Androgen Receptor
(Homo sapiens (Human))
BDBM50303820
((R)-1-Cyclohexyl-1-((5aR,6S)-1-(4-fluorophenyl)-5a...)
Show SMILES C[C@@](O)(C1CCCCC1)[C@H]1CCCC2=Cc3c(ncn3C[C@]12C)-c1ccc(F)cc1 |r,t:14|
Show InChI InChI=1S/C26H33FN2O/c1-25-16-29-17-28-24(18-11-13-21(27)14-12-18)22(29)15-20(25)9-6-10-23(25)26(2,30)19-7-4-3-5-8-19/h11-15,17,19,23,30H,3-10,16H2,1-2H3/t23-,25-,26+/m0/s1
NCI pathway
Reactome pathway
n/an/a>4.00E+3n/an/an/an/an/an/a
Bristol-Myers Squibb Company
Curated by ChEMBL
Assay Description
Binding affinity to androgen receptor
J Med Chem 53: 1270-80 (2010)
Article DOI: 10.1021/jm901551w
BindingDB Entry DOI: 10.7270/Q2KS6SGW