BDBM50303822 (S)-1,1,1-Trifluoro-2-((5aR,6S)-1-(4-fluorophenyl)-5a-methyl-5,5a,6,7,8,9-hexahydroimidazo[1,5-b]isoquinolin-6-yl)propan-2-ol::CHEMBL569061
SMILES: C[C@](O)([C@H]1CCCC2=Cc3c(ncn3C[C@]12C)-c1ccc(F)cc1)C(F)(F)F
InChI Key: InChIKey=RHMNNJWCWCACTK-IHPCNDPISA-N
Data: 1 KI  1 IC50  2 EC50
Activity Spreadsheet -- Enzyme Inhibition Constant Data from BindingDB
Found 4 hits for monomerid = 50303822
Trg + Lig
Ki
nM
ΔG°
kcal/mole
IC50
nM
Kd
nM
EC50/IC50
nM
koff
s-1
kon
M-1s-1
pHTemp
°C
Glucocorticoid receptor
(Homo sapiens (Human))
BDBM50303822
((S)-1,1,1-Trifluoro-2-((5aR,6S)-1-(4-fluorophenyl)...)
Show SMILES C[C@](O)([C@H]1CCCC2=Cc3c(ncn3C[C@]12C)-c1ccc(F)cc1)C(F)(F)F |r,t:7|
Show InChI InChI=1S/C21H22F4N2O/c1-19-11-27-12-26-18(13-6-8-15(22)9-7-13)16(27)10-14(19)4-3-5-17(19)20(2,28)21(23,24)25/h6-10,12,17,28H,3-5,11H2,1-2H3/t17-,19-,20-/m0/s1
5.20n/an/an/an/an/an/an/an/a
Bristol-Myers Squibb Company
Curated by ChEMBL
Assay Description
Displacement of GS-red from human glucocorticoid receptor by fluorescent polarization assay
J Med Chem 53: 1270-80 (2010)
Article DOI: 10.1021/jm901551w
BindingDB Entry DOI: 10.7270/Q2KS6SGW
Androgen Receptor
(Homo sapiens (Human))
BDBM50303822
((S)-1,1,1-Trifluoro-2-((5aR,6S)-1-(4-fluorophenyl)...)
Show SMILES C[C@](O)([C@H]1CCCC2=Cc3c(ncn3C[C@]12C)-c1ccc(F)cc1)C(F)(F)F |r,t:7|
Show InChI InChI=1S/C21H22F4N2O/c1-19-11-27-12-26-18(13-6-8-15(22)9-7-13)16(27)10-14(19)4-3-5-17(19)20(2,28)21(23,24)25/h6-10,12,17,28H,3-5,11H2,1-2H3/t17-,19-,20-/m0/s1
NCI pathway
Reactome pathway
n/an/a>4.00E+3n/an/an/an/an/an/a
Bristol-Myers Squibb Company
Curated by ChEMBL
Assay Description
Binding affinity to androgen receptor
J Med Chem 53: 1270-80 (2010)
Article DOI: 10.1021/jm901551w
BindingDB Entry DOI: 10.7270/Q2KS6SGW
Glucocorticoid receptor
(Homo sapiens (Human))
BDBM50303822
((S)-1,1,1-Trifluoro-2-((5aR,6S)-1-(4-fluorophenyl)...)
Show SMILES C[C@](O)([C@H]1CCCC2=Cc3c(ncn3C[C@]12C)-c1ccc(F)cc1)C(F)(F)F |r,t:7|
Show InChI InChI=1S/C21H22F4N2O/c1-19-11-27-12-26-18(13-6-8-15(22)9-7-13)16(27)10-14(19)4-3-5-17(19)20(2,28)21(23,24)25/h6-10,12,17,28H,3-5,11H2,1-2H3/t17-,19-,20-/m0/s1
n/an/an/an/a 31n/an/an/an/a
Bristol-Myers Squibb Company
Curated by ChEMBL
Assay Description
Transrepression activity at glucocorticoid receptor expressed in human A549 cells assessed as inhibition of PMA-induced AP1 activity after 6 hrs by l...
J Med Chem 53: 1270-80 (2010)
Article DOI: 10.1021/jm901551w
BindingDB Entry DOI: 10.7270/Q2KS6SGW
Glucocorticoid receptor
(Homo sapiens (Human))
BDBM50303822
((S)-1,1,1-Trifluoro-2-((5aR,6S)-1-(4-fluorophenyl)...)
Show SMILES C[C@](O)([C@H]1CCCC2=Cc3c(ncn3C[C@]12C)-c1ccc(F)cc1)C(F)(F)F |r,t:7|
Show InChI InChI=1S/C21H22F4N2O/c1-19-11-27-12-26-18(13-6-8-15(22)9-7-13)16(27)10-14(19)4-3-5-17(19)20(2,28)21(23,24)25/h6-10,12,17,28H,3-5,11H2,1-2H3/t17-,19-,20-/m0/s1
n/an/an/an/a>1.00E+4n/an/an/an/a
Bristol-Myers Squibb Company
Curated by ChEMBL
Assay Description
Transactivation of GAL-4 tagged glucocorticoid receptor ligand binding domain expressed in human HeLa cells assessed as NP1 activation by luciferase ...
J Med Chem 53: 1270-80 (2010)
Article DOI: 10.1021/jm901551w
BindingDB Entry DOI: 10.7270/Q2KS6SGW