BDBM50304123 (Z)-5'-Amino-5-bromo-1H,1'H-[2,3']biindolylidene-3,2'-dione 3-oxime::CHEMBL606920
SMILES: Nc1ccc2NC(=O)C(c2c1)c1[nH]c2ccc(Br)cc2c1N=O
InChI Key: InChIKey=IAIAMJGKNFAHJZ-UHFFFAOYSA-N
Data: 2 IC50
Activity Spreadsheet -- Enzyme Inhibition Constant Data from BindingDB
Found 2 hits for monomerid = 50304123
Trg + Lig
Ki
nM
ΔG°
kcal/mole
IC50
nM
Kd
nM
EC50/IC50
nM
koff
s-1
kon
M-1s-1
pHTemp
°C
Cyclin-Dependent Kinase 5 (CDK5)
(Homo sapiens (Human))
BDBM50304123
((Z)-5'-Amino-5-bromo-1H,1'H-[2,3']biindolylidene-3...)
Show SMILES Nc1ccc2NC(=O)C(c2c1)c1[nH]c2ccc(Br)cc2c1N=O
Show InChI InChI=1S/C16H11BrN4O2/c17-7-1-3-12-10(5-7)14(21-23)15(19-12)13-9-6-8(18)2-4-11(9)20-16(13)22/h1-6,13,19H,18H2,(H,20,22)
NCI pathway
Reactome pathway
n/an/a 1.00E+3n/an/an/an/an/an/a
Universit£ de La Rochelle
Curated by ChEMBL
Assay Description
Inhibition of GST-fused CDK5/p25 expressed in Escherichia coli assessed as [gamma-33P]ATP incorporation after 10 mins by scintillation counting
Bioorg Med Chem 17: 6257-63 (2009)
Article DOI: 10.1016/j.bmc.2009.07.051
BindingDB Entry DOI: 10.7270/Q2BR8S9W
Dual-specificity tyrosine-(Y)-phosphorylation regulated kinase 1A
(RAT)
BDBM50304123
((Z)-5'-Amino-5-bromo-1H,1'H-[2,3']biindolylidene-3...)
Show SMILES Nc1ccc2NC(=O)C(c2c1)c1[nH]c2ccc(Br)cc2c1N=O
Show InChI InChI=1S/C16H11BrN4O2/c17-7-1-3-12-10(5-7)14(21-23)15(19-12)13-9-6-8(18)2-4-11(9)20-16(13)22/h1-6,13,19H,18H2,(H,20,22)
n/an/a>1.00E+4n/an/an/an/an/an/a
Universit£ de La Rochelle
Curated by ChEMBL
Assay Description
Inhibition of GST-fused rat recombinant DYRK1A expressed in Escherichia coli assessed as [gamma-33P]ATP incorporation after 10 mins by scintillation ...
Bioorg Med Chem 17: 6257-63 (2009)
Article DOI: 10.1016/j.bmc.2009.07.051
BindingDB Entry DOI: 10.7270/Q2BR8S9W