BDBM50304199 CHEMBL604992::N-[4-(6''-Methoxybenzo[d]thiazol-2''-yl)phenyl]-6'-methoxy-7'-[3-(4-methylpiperazin-1-yl)propoxy]quinazolin-4'-amine
SMILES: COc1cc2c(Nc3ccc(cc3)-c3nc4ccc(F)cc4s3)ncnc2cc1OCCCN1CCN(C)CC1
InChI Key: InChIKey=KBJCTAIADOTYHC-UHFFFAOYSA-N
Data: 8 IC50  4 EC50
Activity Spreadsheet -- Enzyme Inhibition Constant Data from BindingDB
Found 12 hits for monomerid = 50304199
Trg + Lig
Ki
nM
ΔG°
kcal/mole
IC50
nM
Kd
nM
EC50/IC50
nM
koff
s-1
kon
M-1s-1
pHTemp
°C
Aurora kinase B
(Homo sapiens (Human))
BDBM50304199
(CHEMBL604992 | N-[4-(6''-Methoxybenzo[d]thiazol-2'...)
Show SMILES COc1cc2c(Nc3ccc(cc3)-c3nc4ccc(F)cc4s3)ncnc2cc1OCCCN1CCN(C)CC1
Show InChI InChI=1S/C30H31FN6O2S/c1-36-11-13-37(14-12-36)10-3-15-39-27-18-25-23(17-26(27)38-2)29(33-19-32-25)34-22-7-4-20(5-8-22)30-35-24-9-6-21(31)16-28(24)40-30/h4-9,16-19H,3,10-15H2,1-2H3,(H,32,33,34)
Reactome pathway
n/an/an/an/a>1.00E+4n/an/an/an/a
4SC AG
Curated by ChEMBL
Assay Description
Inhibition of Aurora-B in human HCT116 cells by cellular proliferation assay
Bioorg Med Chem 17: 6728-37 (2009)
Article DOI: 10.1016/j.bmc.2009.07.047
BindingDB Entry DOI: 10.7270/Q2FJ2GWC
Epidermal growth factor receptor
(Homo sapiens (Human))
BDBM50304199
(CHEMBL604992 | N-[4-(6''-Methoxybenzo[d]thiazol-2'...)
Show SMILES COc1cc2c(Nc3ccc(cc3)-c3nc4ccc(F)cc4s3)ncnc2cc1OCCCN1CCN(C)CC1
Show InChI InChI=1S/C30H31FN6O2S/c1-36-11-13-37(14-12-36)10-3-15-39-27-18-25-23(17-26(27)38-2)29(33-19-32-25)34-22-7-4-20(5-8-22)30-35-24-9-6-21(31)16-28(24)40-30/h4-9,16-19H,3,10-15H2,1-2H3,(H,32,33,34)
n/an/an/an/a>1.00E+4n/an/an/an/a
4SC AG
Curated by ChEMBL
Assay Description
Inhibition of EGFR in human HCT116 cells by cellular phosphorylation assay
Bioorg Med Chem 17: 6728-37 (2009)
Article DOI: 10.1016/j.bmc.2009.07.047
BindingDB Entry DOI: 10.7270/Q2FJ2GWC
Focal adhesion kinase 1/vascular endothelial growth factor receptor 3
(Homo sapiens (Human))
BDBM50304199
(CHEMBL604992 | N-[4-(6''-Methoxybenzo[d]thiazol-2'...)
Show SMILES COc1cc2c(Nc3ccc(cc3)-c3nc4ccc(F)cc4s3)ncnc2cc1OCCCN1CCN(C)CC1
Show InChI InChI=1S/C30H31FN6O2S/c1-36-11-13-37(14-12-36)10-3-15-39-27-18-25-23(17-26(27)38-2)29(33-19-32-25)34-22-7-4-20(5-8-22)30-35-24-9-6-21(31)16-28(24)40-30/h4-9,16-19H,3,10-15H2,1-2H3,(H,32,33,34)
n/an/an/an/a>1.00E+4n/an/an/an/a
4SC AG
Curated by ChEMBL
Assay Description
Inhibition of VEGFR3 in human HCT116 cells by cellular phosphorylation assay
Bioorg Med Chem 17: 6728-37 (2009)
Article DOI: 10.1016/j.bmc.2009.07.047
BindingDB Entry DOI: 10.7270/Q2FJ2GWC
Focal adhesion kinase 1/vascular endothelial growth factor receptor 3
(Homo sapiens (Human))
BDBM50304199
(CHEMBL604992 | N-[4-(6''-Methoxybenzo[d]thiazol-2'...)
Show SMILES COc1cc2c(Nc3ccc(cc3)-c3nc4ccc(F)cc4s3)ncnc2cc1OCCCN1CCN(C)CC1
Show InChI InChI=1S/C30H31FN6O2S/c1-36-11-13-37(14-12-36)10-3-15-39-27-18-25-23(17-26(27)38-2)29(33-19-32-25)34-22-7-4-20(5-8-22)30-35-24-9-6-21(31)16-28(24)40-30/h4-9,16-19H,3,10-15H2,1-2H3,(H,32,33,34)
n/an/a 865n/an/an/an/an/an/a
4SC AG
Curated by ChEMBL
Assay Description
Inhibition of VEGFR3 by microplate scintillation counting
Bioorg Med Chem 17: 6728-37 (2009)
Article DOI: 10.1016/j.bmc.2009.07.047
BindingDB Entry DOI: 10.7270/Q2FJ2GWC
Angiopoietin-1 receptor
(Homo sapiens (Human))
BDBM50304199
(CHEMBL604992 | N-[4-(6''-Methoxybenzo[d]thiazol-2'...)
Show SMILES COc1cc2c(Nc3ccc(cc3)-c3nc4ccc(F)cc4s3)ncnc2cc1OCCCN1CCN(C)CC1
Show InChI InChI=1S/C30H31FN6O2S/c1-36-11-13-37(14-12-36)10-3-15-39-27-18-25-23(17-26(27)38-2)29(33-19-32-25)34-22-7-4-20(5-8-22)30-35-24-9-6-21(31)16-28(24)40-30/h4-9,16-19H,3,10-15H2,1-2H3,(H,32,33,34)
n/an/a 235n/an/an/an/an/an/a
4SC AG
Curated by ChEMBL
Assay Description
Inhibition of TIE2 by microplate scintillation counting
Bioorg Med Chem 17: 6728-37 (2009)
Article DOI: 10.1016/j.bmc.2009.07.047
BindingDB Entry DOI: 10.7270/Q2FJ2GWC
Epidermal growth factor receptor
(Homo sapiens (Human))
BDBM50304199
(CHEMBL604992 | N-[4-(6''-Methoxybenzo[d]thiazol-2'...)
Show SMILES COc1cc2c(Nc3ccc(cc3)-c3nc4ccc(F)cc4s3)ncnc2cc1OCCCN1CCN(C)CC1
Show InChI InChI=1S/C30H31FN6O2S/c1-36-11-13-37(14-12-36)10-3-15-39-27-18-25-23(17-26(27)38-2)29(33-19-32-25)34-22-7-4-20(5-8-22)30-35-24-9-6-21(31)16-28(24)40-30/h4-9,16-19H,3,10-15H2,1-2H3,(H,32,33,34)
n/an/a 730n/an/an/an/an/an/a
4SC AG
Curated by ChEMBL
Assay Description
Inhibition of wild type EGF-R by microplate scintillation counting
Bioorg Med Chem 17: 6728-37 (2009)
Article DOI: 10.1016/j.bmc.2009.07.047
BindingDB Entry DOI: 10.7270/Q2FJ2GWC
Angiopoietin-1 receptor
(Homo sapiens (Human))
BDBM50304199
(CHEMBL604992 | N-[4-(6''-Methoxybenzo[d]thiazol-2'...)
Show SMILES COc1cc2c(Nc3ccc(cc3)-c3nc4ccc(F)cc4s3)ncnc2cc1OCCCN1CCN(C)CC1
Show InChI InChI=1S/C30H31FN6O2S/c1-36-11-13-37(14-12-36)10-3-15-39-27-18-25-23(17-26(27)38-2)29(33-19-32-25)34-22-7-4-20(5-8-22)30-35-24-9-6-21(31)16-28(24)40-30/h4-9,16-19H,3,10-15H2,1-2H3,(H,32,33,34)
n/an/an/an/a>1.00E+4n/an/an/an/a
4SC AG
Curated by ChEMBL
Assay Description
Inhibition of TIE2 by microplate scintillation counting
Bioorg Med Chem 17: 6728-37 (2009)
Article DOI: 10.1016/j.bmc.2009.07.047
BindingDB Entry DOI: 10.7270/Q2FJ2GWC
Aurora kinase A
(Homo sapiens (Human))
BDBM50304199
(CHEMBL604992 | N-[4-(6''-Methoxybenzo[d]thiazol-2'...)
Show SMILES COc1cc2c(Nc3ccc(cc3)-c3nc4ccc(F)cc4s3)ncnc2cc1OCCCN1CCN(C)CC1
Show InChI InChI=1S/C30H31FN6O2S/c1-36-11-13-37(14-12-36)10-3-15-39-27-18-25-23(17-26(27)38-2)29(33-19-32-25)34-22-7-4-20(5-8-22)30-35-24-9-6-21(31)16-28(24)40-30/h4-9,16-19H,3,10-15H2,1-2H3,(H,32,33,34)
NCI pathway
Reactome pathway
n/an/a 26n/an/an/an/an/an/a
4SC AG
Curated by ChEMBL
Assay Description
Inhibition of Aurora-A by microplate scintillation counting
Bioorg Med Chem 17: 6728-37 (2009)
Article DOI: 10.1016/j.bmc.2009.07.047
BindingDB Entry DOI: 10.7270/Q2FJ2GWC
Vascular endothelial growth factor receptor 2
(Homo sapiens (Human))
BDBM50304199
(CHEMBL604992 | N-[4-(6''-Methoxybenzo[d]thiazol-2'...)
Show SMILES COc1cc2c(Nc3ccc(cc3)-c3nc4ccc(F)cc4s3)ncnc2cc1OCCCN1CCN(C)CC1
Show InChI InChI=1S/C30H31FN6O2S/c1-36-11-13-37(14-12-36)10-3-15-39-27-18-25-23(17-26(27)38-2)29(33-19-32-25)34-22-7-4-20(5-8-22)30-35-24-9-6-21(31)16-28(24)40-30/h4-9,16-19H,3,10-15H2,1-2H3,(H,32,33,34)
NCI pathway
Reactome pathway
n/an/a 335n/an/an/an/an/an/a
4SC AG
Curated by ChEMBL
Assay Description
Inhibition of VEGFR2 by microplate scintillation counting
Bioorg Med Chem 17: 6728-37 (2009)
Article DOI: 10.1016/j.bmc.2009.07.047
BindingDB Entry DOI: 10.7270/Q2FJ2GWC
Receptor tyrosine-protein kinase erbB-2
(Homo sapiens (Human))
BDBM50304199
(CHEMBL604992 | N-[4-(6''-Methoxybenzo[d]thiazol-2'...)
Show SMILES COc1cc2c(Nc3ccc(cc3)-c3nc4ccc(F)cc4s3)ncnc2cc1OCCCN1CCN(C)CC1
Show InChI InChI=1S/C30H31FN6O2S/c1-36-11-13-37(14-12-36)10-3-15-39-27-18-25-23(17-26(27)38-2)29(33-19-32-25)34-22-7-4-20(5-8-22)30-35-24-9-6-21(31)16-28(24)40-30/h4-9,16-19H,3,10-15H2,1-2H3,(H,32,33,34)
n/an/a 6.95E+3n/an/an/an/an/an/a
4SC AG
Curated by ChEMBL
Assay Description
Inhibition of ERBB2 by microplate scintillation counting
Bioorg Med Chem 17: 6728-37 (2009)
Article DOI: 10.1016/j.bmc.2009.07.047
BindingDB Entry DOI: 10.7270/Q2FJ2GWC
Platelet-derived growth factor receptor beta
(Homo sapiens (Human))
BDBM50304199
(CHEMBL604992 | N-[4-(6''-Methoxybenzo[d]thiazol-2'...)
Show SMILES COc1cc2c(Nc3ccc(cc3)-c3nc4ccc(F)cc4s3)ncnc2cc1OCCCN1CCN(C)CC1
Show InChI InChI=1S/C30H31FN6O2S/c1-36-11-13-37(14-12-36)10-3-15-39-27-18-25-23(17-26(27)38-2)29(33-19-32-25)34-22-7-4-20(5-8-22)30-35-24-9-6-21(31)16-28(24)40-30/h4-9,16-19H,3,10-15H2,1-2H3,(H,32,33,34)
NCI pathway
Reactome pathway
n/an/a 3.40E+3n/an/an/an/an/an/a
4SC AG
Curated by ChEMBL
Assay Description
Inhibition of PDGFRbeta by microplate scintillation counting
Bioorg Med Chem 17: 6728-37 (2009)
Article DOI: 10.1016/j.bmc.2009.07.047
BindingDB Entry DOI: 10.7270/Q2FJ2GWC
Aurora kinase B
(Homo sapiens (Human))
BDBM50304199
(CHEMBL604992 | N-[4-(6''-Methoxybenzo[d]thiazol-2'...)
Show SMILES COc1cc2c(Nc3ccc(cc3)-c3nc4ccc(F)cc4s3)ncnc2cc1OCCCN1CCN(C)CC1
Show InChI InChI=1S/C30H31FN6O2S/c1-36-11-13-37(14-12-36)10-3-15-39-27-18-25-23(17-26(27)38-2)29(33-19-32-25)34-22-7-4-20(5-8-22)30-35-24-9-6-21(31)16-28(24)40-30/h4-9,16-19H,3,10-15H2,1-2H3,(H,32,33,34)
Reactome pathway
n/an/a 41n/an/an/an/an/an/a
4SC AG
Curated by ChEMBL
Assay Description
Inhibition of Aurora-B by microplate scintillation counting
Bioorg Med Chem 17: 6728-37 (2009)
Article DOI: 10.1016/j.bmc.2009.07.047
BindingDB Entry DOI: 10.7270/Q2FJ2GWC