BDBM50304207 CHEMBL595615::N-(4-(benzo[d]thiazol-2-yl)phenyl)-6-methoxy-7-(3-(4-methylpiperazin-1-yl)propoxy)quinazolin-4-amine
SMILES: COc1cc2c(Nc3ccc(cc3)-c3nc4ccccc4s3)ncnc2cc1OCCCN1CCN(C)CC1
InChI Key: InChIKey=OZWMSXPIQVMFDE-UHFFFAOYSA-N
Data: 8 IC50
Activity Spreadsheet -- Enzyme Inhibition Constant Data from BindingDB
Found 8 hits for monomerid = 50304207
Trg + Lig
Ki
nM
ΔG°
kcal/mole
IC50
nM
Kd
nM
EC50/IC50
nM
koff
s-1
kon
M-1s-1
pHTemp
°C
Aurora kinase B
(Homo sapiens (Human))
BDBM50304207
(CHEMBL595615 | N-(4-(benzo[d]thiazol-2-yl)phenyl)-...)
Show SMILES COc1cc2c(Nc3ccc(cc3)-c3nc4ccccc4s3)ncnc2cc1OCCCN1CCN(C)CC1
Show InChI InChI=1S/C30H32N6O2S/c1-35-13-15-36(16-14-35)12-5-17-38-27-19-25-23(18-26(27)37-2)29(32-20-31-25)33-22-10-8-21(9-11-22)30-34-24-6-3-4-7-28(24)39-30/h3-4,6-11,18-20H,5,12-17H2,1-2H3,(H,31,32,33)
Reactome pathway
n/an/a 60n/an/an/an/an/an/a
4SC AG
Curated by ChEMBL
Assay Description
Inhibition of Aurora-B by microplate scintillation counting
Bioorg Med Chem 17: 6728-37 (2009)
Article DOI: 10.1016/j.bmc.2009.07.047
BindingDB Entry DOI: 10.7270/Q2FJ2GWC
Focal adhesion kinase 1/vascular endothelial growth factor receptor 3
(Homo sapiens (Human))
BDBM50304207
(CHEMBL595615 | N-(4-(benzo[d]thiazol-2-yl)phenyl)-...)
Show SMILES COc1cc2c(Nc3ccc(cc3)-c3nc4ccccc4s3)ncnc2cc1OCCCN1CCN(C)CC1
Show InChI InChI=1S/C30H32N6O2S/c1-35-13-15-36(16-14-35)12-5-17-38-27-19-25-23(18-26(27)37-2)29(32-20-31-25)33-22-10-8-21(9-11-22)30-34-24-6-3-4-7-28(24)39-30/h3-4,6-11,18-20H,5,12-17H2,1-2H3,(H,31,32,33)
n/an/a 69n/an/an/an/an/an/a
4SC AG
Curated by ChEMBL
Assay Description
Inhibition of VEGFR3 by microplate scintillation counting
Bioorg Med Chem 17: 6728-37 (2009)
Article DOI: 10.1016/j.bmc.2009.07.047
BindingDB Entry DOI: 10.7270/Q2FJ2GWC
Aurora kinase A
(Homo sapiens (Human))
BDBM50304207
(CHEMBL595615 | N-(4-(benzo[d]thiazol-2-yl)phenyl)-...)
Show SMILES COc1cc2c(Nc3ccc(cc3)-c3nc4ccccc4s3)ncnc2cc1OCCCN1CCN(C)CC1
Show InChI InChI=1S/C30H32N6O2S/c1-35-13-15-36(16-14-35)12-5-17-38-27-19-25-23(18-26(27)37-2)29(32-20-31-25)33-22-10-8-21(9-11-22)30-34-24-6-3-4-7-28(24)39-30/h3-4,6-11,18-20H,5,12-17H2,1-2H3,(H,31,32,33)
NCI pathway
Reactome pathway
n/an/a 14n/an/an/an/an/an/a
4SC AG
Curated by ChEMBL
Assay Description
Inhibition of Aurora-A by microplate scintillation counting
Bioorg Med Chem 17: 6728-37 (2009)
Article DOI: 10.1016/j.bmc.2009.07.047
BindingDB Entry DOI: 10.7270/Q2FJ2GWC
Epidermal growth factor receptor
(Homo sapiens (Human))
BDBM50304207
(CHEMBL595615 | N-(4-(benzo[d]thiazol-2-yl)phenyl)-...)
Show SMILES COc1cc2c(Nc3ccc(cc3)-c3nc4ccccc4s3)ncnc2cc1OCCCN1CCN(C)CC1
Show InChI InChI=1S/C30H32N6O2S/c1-35-13-15-36(16-14-35)12-5-17-38-27-19-25-23(18-26(27)37-2)29(32-20-31-25)33-22-10-8-21(9-11-22)30-34-24-6-3-4-7-28(24)39-30/h3-4,6-11,18-20H,5,12-17H2,1-2H3,(H,31,32,33)
n/an/a 46n/an/an/an/an/an/a
4SC AG
Curated by ChEMBL
Assay Description
Inhibition of wild type EGF-R by microplate scintillation counting
Bioorg Med Chem 17: 6728-37 (2009)
Article DOI: 10.1016/j.bmc.2009.07.047
BindingDB Entry DOI: 10.7270/Q2FJ2GWC
Angiopoietin-1 receptor
(Homo sapiens (Human))
BDBM50304207
(CHEMBL595615 | N-(4-(benzo[d]thiazol-2-yl)phenyl)-...)
Show SMILES COc1cc2c(Nc3ccc(cc3)-c3nc4ccccc4s3)ncnc2cc1OCCCN1CCN(C)CC1
Show InChI InChI=1S/C30H32N6O2S/c1-35-13-15-36(16-14-35)12-5-17-38-27-19-25-23(18-26(27)37-2)29(32-20-31-25)33-22-10-8-21(9-11-22)30-34-24-6-3-4-7-28(24)39-30/h3-4,6-11,18-20H,5,12-17H2,1-2H3,(H,31,32,33)
n/an/a 54n/an/an/an/an/an/a
4SC AG
Curated by ChEMBL
Assay Description
Inhibition of TIE2 by microplate scintillation counting
Bioorg Med Chem 17: 6728-37 (2009)
Article DOI: 10.1016/j.bmc.2009.07.047
BindingDB Entry DOI: 10.7270/Q2FJ2GWC
Receptor tyrosine-protein kinase erbB-2
(Homo sapiens (Human))
BDBM50304207
(CHEMBL595615 | N-(4-(benzo[d]thiazol-2-yl)phenyl)-...)
Show SMILES COc1cc2c(Nc3ccc(cc3)-c3nc4ccccc4s3)ncnc2cc1OCCCN1CCN(C)CC1
Show InChI InChI=1S/C30H32N6O2S/c1-35-13-15-36(16-14-35)12-5-17-38-27-19-25-23(18-26(27)37-2)29(32-20-31-25)33-22-10-8-21(9-11-22)30-34-24-6-3-4-7-28(24)39-30/h3-4,6-11,18-20H,5,12-17H2,1-2H3,(H,31,32,33)
n/an/a 100n/an/an/an/an/an/a
4SC AG
Curated by ChEMBL
Assay Description
Inhibition of ERBB2 by microplate scintillation counting
Bioorg Med Chem 17: 6728-37 (2009)
Article DOI: 10.1016/j.bmc.2009.07.047
BindingDB Entry DOI: 10.7270/Q2FJ2GWC
Platelet-derived growth factor receptor beta
(Homo sapiens (Human))
BDBM50304207
(CHEMBL595615 | N-(4-(benzo[d]thiazol-2-yl)phenyl)-...)
Show SMILES COc1cc2c(Nc3ccc(cc3)-c3nc4ccccc4s3)ncnc2cc1OCCCN1CCN(C)CC1
Show InChI InChI=1S/C30H32N6O2S/c1-35-13-15-36(16-14-35)12-5-17-38-27-19-25-23(18-26(27)37-2)29(32-20-31-25)33-22-10-8-21(9-11-22)30-34-24-6-3-4-7-28(24)39-30/h3-4,6-11,18-20H,5,12-17H2,1-2H3,(H,31,32,33)
NCI pathway
Reactome pathway
n/an/a 1.40E+3n/an/an/an/an/an/a
4SC AG
Curated by ChEMBL
Assay Description
Inhibition of PDGFRbeta by microplate scintillation counting
Bioorg Med Chem 17: 6728-37 (2009)
Article DOI: 10.1016/j.bmc.2009.07.047
BindingDB Entry DOI: 10.7270/Q2FJ2GWC
Vascular endothelial growth factor receptor 2
(Homo sapiens (Human))
BDBM50304207
(CHEMBL595615 | N-(4-(benzo[d]thiazol-2-yl)phenyl)-...)
Show SMILES COc1cc2c(Nc3ccc(cc3)-c3nc4ccccc4s3)ncnc2cc1OCCCN1CCN(C)CC1
Show InChI InChI=1S/C30H32N6O2S/c1-35-13-15-36(16-14-35)12-5-17-38-27-19-25-23(18-26(27)37-2)29(32-20-31-25)33-22-10-8-21(9-11-22)30-34-24-6-3-4-7-28(24)39-30/h3-4,6-11,18-20H,5,12-17H2,1-2H3,(H,31,32,33)
NCI pathway
Reactome pathway
n/an/a 12n/an/an/an/an/an/a
4SC AG
Curated by ChEMBL
Assay Description
Inhibition of VEGFR2 by microplate scintillation counting
Bioorg Med Chem 17: 6728-37 (2009)
Article DOI: 10.1016/j.bmc.2009.07.047
BindingDB Entry DOI: 10.7270/Q2FJ2GWC