BDBM50304357 4-(4-ethylphenoxy)-butyric acid 6-oxo-6H-benzo[c]chromen-3-yl ester::CHEMBL595128
SMILES: CCc1ccc(OCCCC(O)Oc2ccc3c(c2)oc(=O)c2ccccc32)cc1
InChI Key: InChIKey=ZRVNMEZPZXJOIW-UHFFFAOYSA-N
Data: 2 KI  2 IC50
Activity Spreadsheet -- Enzyme Inhibition Constant Data from BindingDB
Found 4 hits for monomerid = 50304357
Trg + Lig
Ki
nM
ΔG°
kcal/mole
IC50
nM
Kd
nM
EC50/IC50
nM
koff
s-1
kon
M-1s-1
pHTemp
°C
NAD-dependent deacetylase HST2
(Saccharomyces cerevisiae)
BDBM50304357
(4-(4-ethylphenoxy)-butyric acid 6-oxo-6H-benzo[c]c...)
Show SMILES CCc1ccc(OCCCC(O)Oc2ccc3c(c2)oc(=O)c2ccccc32)cc1
Show InChI InChI=1S/C25H24O5/c1-2-17-9-11-18(12-10-17)28-15-5-8-24(26)29-19-13-14-21-20-6-3-4-7-22(20)25(27)30-23(21)16-19/h3-4,6-7,9-14,16,24,26H,2,5,8,15H2,1H3
1.20E+3n/an/an/an/an/an/an/an/a
Institute
Curated by ChEMBL
Assay Description
Noncompetitive inhibition of yeast Hst2 using NAD+ substrate
Bioorg Med Chem 17: 7031-41 (2009)
Article DOI: 10.1016/j.bmc.2009.07.073
BindingDB Entry DOI: 10.7270/Q21V5FWG
NAD-dependent deacetylase HST2
(Saccharomyces cerevisiae)
BDBM50304357
(4-(4-ethylphenoxy)-butyric acid 6-oxo-6H-benzo[c]c...)
Show SMILES CCc1ccc(OCCCC(O)Oc2ccc3c(c2)oc(=O)c2ccccc32)cc1
Show InChI InChI=1S/C25H24O5/c1-2-17-9-11-18(12-10-17)28-15-5-8-24(26)29-19-13-14-21-20-6-3-4-7-22(20)25(27)30-23(21)16-19/h3-4,6-7,9-14,16,24,26H,2,5,8,15H2,1H3
6.30E+3n/an/an/an/an/an/an/an/a
Institute
Curated by ChEMBL
Assay Description
Noncompetitive inhibition of yeast Hst2 using Acetyl-lysine substrate
Bioorg Med Chem 17: 7031-41 (2009)
Article DOI: 10.1016/j.bmc.2009.07.073
BindingDB Entry DOI: 10.7270/Q21V5FWG
NAD-dependent deacetylase HST2
(Saccharomyces cerevisiae)
BDBM50304357
(4-(4-ethylphenoxy)-butyric acid 6-oxo-6H-benzo[c]c...)
Show SMILES CCc1ccc(OCCCC(O)Oc2ccc3c(c2)oc(=O)c2ccccc32)cc1
Show InChI InChI=1S/C25H24O5/c1-2-17-9-11-18(12-10-17)28-15-5-8-24(26)29-19-13-14-21-20-6-3-4-7-22(20)25(27)30-23(21)16-19/h3-4,6-7,9-14,16,24,26H,2,5,8,15H2,1H3
n/an/a 6.50E+3n/an/an/an/an/an/a
Institute
Curated by ChEMBL
Assay Description
Inhibition of yeast Hst2 by fluorimetric assay
Bioorg Med Chem 17: 7031-41 (2009)
Article DOI: 10.1016/j.bmc.2009.07.073
BindingDB Entry DOI: 10.7270/Q21V5FWG
NAD-Dependent Deacetylase Sirtuin-1
(Homo sapiens (Human))
BDBM50304357
(4-(4-ethylphenoxy)-butyric acid 6-oxo-6H-benzo[c]c...)
Show SMILES CCc1ccc(OCCCC(O)Oc2ccc3c(c2)oc(=O)c2ccccc32)cc1
Show InChI InChI=1S/C25H24O5/c1-2-17-9-11-18(12-10-17)28-15-5-8-24(26)29-19-13-14-21-20-6-3-4-7-22(20)25(27)30-23(21)16-19/h3-4,6-7,9-14,16,24,26H,2,5,8,15H2,1H3
NCI pathway
Reactome pathway
n/an/a 6.00E+3n/an/an/an/an/an/a
Institute
Curated by ChEMBL
Assay Description
Inhibition of human full length SIRT1 expressed in DE3 cells by fluorimetric assay
Bioorg Med Chem 17: 7031-41 (2009)
Article DOI: 10.1016/j.bmc.2009.07.073
BindingDB Entry DOI: 10.7270/Q21V5FWG