null
SMILES: Sc1nnc(o1)-c1cccc(OCc2ccccc2)c1
InChI Key: InChIKey=YVTXJZDSFRUREA-UHFFFAOYSA-N
Activity Spreadsheet -- Enzyme Inhibition Constant Data from BindingDB
Found 3 hits for monomerid = 50304607
Trg + Lig
Ki
nM
ΔG°
kcal/mole
IC50
nM
Kd
nM
EC50/IC50
nM
koff
s-1
kon
M-1s-1
pHTemp
°C
Polyphenol oxidase 2
(Agaricus bisporus (Common mushroom))
BDBM50304607
(5-(3-(benzyloxy)phenyl)-1,3,4-oxadiazole-2(3H)-thi...)
Show SMILES Sc1nnc(o1)-c1cccc(OCc2ccccc2)c1
Show InChI InChI=1S/C15H12N2O2S/c20-15-17-16-14(19-15)12-7-4-8-13(9-12)18-10-11-5-2-1-3-6-11/h1-9H,10H2,(H,17,20)
3.64E+3n/an/an/an/an/an/an/an/a
King Saud University
Curated by ChEMBL
Assay Description
Inhibition of mashroom tyrosinase
Bioorg Med Chem 18: 4042-8 (2010)
Article DOI: 10.1016/j.bmc.2010.04.021
BindingDB Entry DOI: 10.7270/Q2FJ2GZ8
Ectonucleotide pyrophosphatase/phosphodiesterase family member 1
(Homo sapiens (Human))
BDBM50304607
(5-(3-(benzyloxy)phenyl)-1,3,4-oxadiazole-2(3H)-thi...)
Show SMILES Sc1nnc(o1)-c1cccc(OCc2ccccc2)c1
Show InChI InChI=1S/C15H12N2O2S/c20-15-17-16-14(19-15)12-7-4-8-13(9-12)18-10-11-5-2-1-3-6-11/h1-9H,10H2,(H,17,20)
Reactome pathway
3.60E+5n/an/an/an/an/an/an/an/a
University of Karachi
Curated by ChEMBL
Assay Description
Noncompetitive inhibition of human recombinant NPP1 by Dixon plot analysis
Bioorg Med Chem 17: 7816-22 (2009)
Article DOI: 10.1016/j.bmc.2009.09.011
BindingDB Entry DOI: 10.7270/Q2ZC82X2
Ectonucleotide pyrophosphatase/phosphodiesterase family member 1
(Homo sapiens (Human))
BDBM50304607
(5-(3-(benzyloxy)phenyl)-1,3,4-oxadiazole-2(3H)-thi...)
Show SMILES Sc1nnc(o1)-c1cccc(OCc2ccccc2)c1
Show InChI InChI=1S/C15H12N2O2S/c20-15-17-16-14(19-15)12-7-4-8-13(9-12)18-10-11-5-2-1-3-6-11/h1-9H,10H2,(H,17,20)
Reactome pathway
n/an/a 4.94E+5n/an/an/an/an/an/a
University of Karachi
Curated by ChEMBL
Assay Description
Inhibition of human recombinant NPP1 assessed as release of p-nitrophenol by microtitre plate spectrophotometry
Bioorg Med Chem 17: 7816-22 (2009)
Article DOI: 10.1016/j.bmc.2009.09.011
BindingDB Entry DOI: 10.7270/Q2ZC82X2