BDBM50304608 5,5'-(propane-1,3-diyl)bis(1,3,4-oxadiazole-2(3H)-thione)::Bis(1,3,4-oxadiazol-2-propyl)-5-thione::CHEMBL594067
SMILES: Sc1nnc(CCCc2nnc(S)o2)o1
InChI Key: InChIKey=XQFRUIPQODDPMN-UHFFFAOYSA-N
Data: 2 KI  1 IC50
Activity Spreadsheet -- Enzyme Inhibition Constant Data from BindingDB
Found 3 hits for monomerid = 50304608
Trg + Lig
Ki
nM
ΔG°
kcal/mole
IC50
nM
Kd
nM
EC50/IC50
nM
koff
s-1
kon
M-1s-1
pHTemp
°C
Polyphenol oxidase 2
(Agaricus bisporus (Common mushroom))
BDBM50304608
(5,5'-(propane-1,3-diyl)bis(1,3,4-oxadiazole-2(3H)-...)
Show SMILES Sc1nnc(CCCc2nnc(S)o2)o1
Show InChI InChI=1S/C7H8N4O2S2/c14-6-10-8-4(12-6)2-1-3-5-9-11-7(15)13-5/h1-3H2,(H,10,14)(H,11,15)
1.90E+3n/an/an/an/an/an/an/an/a
King Saud University
Curated by ChEMBL
Assay Description
Inhibition of mashroom tyrosinase
Bioorg Med Chem 18: 4042-8 (2010)
Article DOI: 10.1016/j.bmc.2010.04.021
BindingDB Entry DOI: 10.7270/Q2FJ2GZ8
Ectonucleotide pyrophosphatase/phosphodiesterase family member 1
(Homo sapiens (Human))
BDBM50304608
(5,5'-(propane-1,3-diyl)bis(1,3,4-oxadiazole-2(3H)-...)
Show SMILES Sc1nnc(CCCc2nnc(S)o2)o1
Show InChI InChI=1S/C7H8N4O2S2/c14-6-10-8-4(12-6)2-1-3-5-9-11-7(15)13-5/h1-3H2,(H,10,14)(H,11,15)
Reactome pathway
1.50E+5n/an/an/an/an/an/an/an/a
University of Karachi
Curated by ChEMBL
Assay Description
Noncompetitive inhibition of human recombinant NPP1 by Dixon plot analysis
Bioorg Med Chem 17: 7816-22 (2009)
Article DOI: 10.1016/j.bmc.2009.09.011
BindingDB Entry DOI: 10.7270/Q2ZC82X2
Ectonucleotide pyrophosphatase/phosphodiesterase family member 1
(Homo sapiens (Human))
BDBM50304608
(5,5'-(propane-1,3-diyl)bis(1,3,4-oxadiazole-2(3H)-...)
Show SMILES Sc1nnc(CCCc2nnc(S)o2)o1
Show InChI InChI=1S/C7H8N4O2S2/c14-6-10-8-4(12-6)2-1-3-5-9-11-7(15)13-5/h1-3H2,(H,10,14)(H,11,15)
Reactome pathway
n/an/a 4.67E+5n/an/an/an/an/an/a
University of Karachi
Curated by ChEMBL
Assay Description
Inhibition of human recombinant NPP1 assessed as release of p-nitrophenol by microtitre plate spectrophotometry
Bioorg Med Chem 17: 7816-22 (2009)
Article DOI: 10.1016/j.bmc.2009.09.011
BindingDB Entry DOI: 10.7270/Q2ZC82X2