BDBM50304611 3-(5-((5-(4-chlorophenyl)furan-2-yl)methylene)-4-oxo-2-thioxothiazolidin-3-yl)propanoic acid::CHEMBL593602
SMILES: OC(=O)CCN1C(=S)S\C(=C\c2ccc(o2)-c2ccc(Cl)cc2)C1=O
InChI Key: InChIKey=YZLFZFALAZYTCI-NTEUORMPSA-N
Data: 1 IC50
PDB links: 1 PDB ID matches this monomer.
Activity Spreadsheet -- Enzyme Inhibition Constant Data from BindingDB
Found 1 hit for monomerid = 50304611
Trg + Lig
Ki
nM
ΔG°
kcal/mole
IC50
nM
Kd
nM
EC50/IC50
nM
koff
s-1
kon
M-1s-1
pHTemp
°C
Hypoxia-inducible factor 1 (FIH)
(Homo sapiens (Human))
BDBM50304611
(3-(5-((5-(4-chlorophenyl)furan-2-yl)methylene)-4-o...)
Show SMILES OC(=O)CCN1C(=S)S\C(=C\c2ccc(o2)-c2ccc(Cl)cc2)C1=O
Show InChI InChI=1S/C17H12ClNO4S2/c18-11-3-1-10(2-4-11)13-6-5-12(23-13)9-14-16(22)19(17(24)25-14)8-7-15(20)21/h1-6,9H,7-8H2,(H,20,21)/b14-9+
n/an/a 6.60E+4n/an/an/an/an/an/a
Sejong University
Curated by ChEMBL
Assay Description
Inhibition of human recombinant FIH1
Bioorg Med Chem 17: 7769-74 (2009)
Article DOI: 10.1016/j.bmc.2009.09.034
BindingDB Entry DOI: 10.7270/Q2TM7B6R