BDBM50304852 1,2-dimethyl-4-(3-(methylthio)phenyl)-5-(quinoxalin-6-yl)-1H-pyrazol-3(2H)-one::CHEMBL595578
SMILES: CSc1cccc(c1)-c1c(-c2ccc3nccnc3c2)n(C)n(C)c1=O
InChI Key: InChIKey=JOPRHYVSMBOIOB-UHFFFAOYSA-N
Data: 1 KI  1 IC50
Activity Spreadsheet -- Enzyme Inhibition Constant Data from BindingDB
Found 2 hits for monomerid = 50304852
Trg + Lig
Ki
nM
ΔG°
kcal/mole
IC50
nM
Kd
nM
EC50/IC50
nM
koff
s-1
kon
M-1s-1
pHTemp
°C
TGF-beta receptor type-1
(Homo sapiens (Human))
BDBM50304852
(1,2-dimethyl-4-(3-(methylthio)phenyl)-5-(quinoxali...)
Show SMILES CSc1cccc(c1)-c1c(-c2ccc3nccnc3c2)n(C)n(C)c1=O
Show InChI InChI=1S/C20H18N4OS/c1-23-19(14-7-8-16-17(12-14)22-10-9-21-16)18(20(25)24(23)2)13-5-4-6-15(11-13)26-3/h4-12H,1-3H3
60n/an/an/an/an/an/an/an/a
Biogen Idec Inc.
Curated by ChEMBL
Assay Description
Displacement of [3H]HTS446284 from human recombinant His-tagged TGFbetaR1 after 1 hr by scintillation counting
Bioorg Med Chem Lett 20: 326-9 (2010)
Article DOI: 10.1016/j.bmcl.2009.10.108
BindingDB Entry DOI: 10.7270/Q2RN37ZK
TGF-beta receptor type-1
(Homo sapiens (Human))
BDBM50304852
(1,2-dimethyl-4-(3-(methylthio)phenyl)-5-(quinoxali...)
Show SMILES CSc1cccc(c1)-c1c(-c2ccc3nccnc3c2)n(C)n(C)c1=O
Show InChI InChI=1S/C20H18N4OS/c1-23-19(14-7-8-16-17(12-14)22-10-9-21-16)18(20(25)24(23)2)13-5-4-6-15(11-13)26-3/h4-12H,1-3H3
n/an/a>1.00E+4n/an/an/an/an/an/a
Biogen Idec Inc.
Curated by ChEMBL
Assay Description
Inhibition of TGFR-1 in human HepG2 cells expressing PAI-luciferase by luciferase reporter gene assay
Bioorg Med Chem Lett 20: 326-9 (2010)
Article DOI: 10.1016/j.bmcl.2009.10.108
BindingDB Entry DOI: 10.7270/Q2RN37ZK