BDBM50304869 4-(furan-2-yl)-1,2-dimethyl-5-(quinoxalin-6-yl)-1H-pyrazol-3(2H)-one::CHEMBL610195
SMILES: Cn1c(c(-c2ccco2)c(=O)n1C)-c1ccc2nccnc2c1
InChI Key: InChIKey=ITVCDIDTNKWPHW-UHFFFAOYSA-N
Data: 1 KI  1 IC50
Activity Spreadsheet -- Enzyme Inhibition Constant Data from BindingDB
Found 2 hits for monomerid = 50304869
Trg + Lig
Ki
nM
ΔG°
kcal/mole
IC50
nM
Kd
nM
EC50/IC50
nM
koff
s-1
kon
M-1s-1
pHTemp
°C
TGF-beta receptor type-1
(Homo sapiens (Human))
BDBM50304869
(4-(furan-2-yl)-1,2-dimethyl-5-(quinoxalin-6-yl)-1H...)
Show SMILES Cn1c(c(-c2ccco2)c(=O)n1C)-c1ccc2nccnc2c1
Show InChI InChI=1S/C17H14N4O2/c1-20-16(11-5-6-12-13(10-11)19-8-7-18-12)15(17(22)21(20)2)14-4-3-9-23-14/h3-10H,1-2H3
190n/an/an/an/an/an/an/an/a
Biogen Idec Inc.
Curated by ChEMBL
Assay Description
Displacement of [3H]HTS446284 from human recombinant His-tagged TGFbetaR1 after 1 hr by scintillation counting
Bioorg Med Chem Lett 20: 326-9 (2010)
Article DOI: 10.1016/j.bmcl.2009.10.108
BindingDB Entry DOI: 10.7270/Q2RN37ZK
TGF-beta receptor type-1
(Homo sapiens (Human))
BDBM50304869
(4-(furan-2-yl)-1,2-dimethyl-5-(quinoxalin-6-yl)-1H...)
Show SMILES Cn1c(c(-c2ccco2)c(=O)n1C)-c1ccc2nccnc2c1
Show InChI InChI=1S/C17H14N4O2/c1-20-16(11-5-6-12-13(10-11)19-8-7-18-12)15(17(22)21(20)2)14-4-3-9-23-14/h3-10H,1-2H3
n/an/a>1.00E+4n/an/an/an/an/an/a
Biogen Idec Inc.
Curated by ChEMBL
Assay Description
Inhibition of TGFR-1 in human HepG2 cells expressing PAI-luciferase by luciferase reporter gene assay
Bioorg Med Chem Lett 20: 326-9 (2010)
Article DOI: 10.1016/j.bmcl.2009.10.108
BindingDB Entry DOI: 10.7270/Q2RN37ZK