BDBM50304964 (S)-2-chloro-4-((1-(methylsulfonyl)pyrrolidin-3-yl)(2-(trifluoromethyl)benzyl)amino)benzonitrile::CHEMBL591092
SMILES: CS(=O)(=O)N1CC[C@@H](C1)N(Cc1ccccc1C(F)(F)F)c1ccc(C#N)c(Cl)c1
InChI Key: InChIKey=DVUOOXZFSLIMAG-KRWDZBQOSA-N
Data: 3 IC50  1 EC50
Activity Spreadsheet -- Enzyme Inhibition Constant Data from BindingDB
Found 4 hits for monomerid = 50304964
Trg + Lig
Ki
nM
ΔG°
kcal/mole
IC50
nM
Kd
nM
EC50/IC50
nM
koff
s-1
kon
M-1s-1
pHTemp
°C
Progesterone receptor
(Homo sapiens (Human))
BDBM50304964
((S)-2-chloro-4-((1-(methylsulfonyl)pyrrolidin-3-yl...)
Show SMILES CS(=O)(=O)N1CC[C@@H](C1)N(Cc1ccccc1C(F)(F)F)c1ccc(C#N)c(Cl)c1 |r|
Show InChI InChI=1S/C20H19ClF3N3O2S/c1-30(28,29)26-9-8-17(13-26)27(16-7-6-14(11-25)19(21)10-16)12-15-4-2-3-5-18(15)20(22,23)24/h2-7,10,17H,8-9,12-13H2,1H3/t17-/m0/s1
n/an/an/an/a 11n/an/an/an/a
GlaxoSmithKline Pharmaceuticals
Curated by ChEMBL
Assay Description
Agonist activity at PR in human T47D cells
Bioorg Med Chem Lett 20: 371-4 (2010)
Article DOI: 10.1016/j.bmcl.2009.10.092
BindingDB Entry DOI: 10.7270/Q2057G17
Cytochrome P450 2C9
(Homo sapiens (Human))
BDBM50304964
((S)-2-chloro-4-((1-(methylsulfonyl)pyrrolidin-3-yl...)
Show SMILES CS(=O)(=O)N1CC[C@@H](C1)N(Cc1ccccc1C(F)(F)F)c1ccc(C#N)c(Cl)c1 |r|
Show InChI InChI=1S/C20H19ClF3N3O2S/c1-30(28,29)26-9-8-17(13-26)27(16-7-6-14(11-25)19(21)10-16)12-15-4-2-3-5-18(15)20(22,23)24/h2-7,10,17H,8-9,12-13H2,1H3/t17-/m0/s1
Reactome pathway
n/an/a 330n/an/an/an/an/an/a
GlaxoSmithKline Pharmaceuticals
Curated by ChEMBL
Assay Description
Inhibition of CYP2C9
Bioorg Med Chem Lett 20: 371-4 (2010)
Article DOI: 10.1016/j.bmcl.2009.10.092
BindingDB Entry DOI: 10.7270/Q2057G17
Cytochrome P450 2D6
(Homo sapiens (Human))
BDBM50304964
((S)-2-chloro-4-((1-(methylsulfonyl)pyrrolidin-3-yl...)
Show SMILES CS(=O)(=O)N1CC[C@@H](C1)N(Cc1ccccc1C(F)(F)F)c1ccc(C#N)c(Cl)c1 |r|
Show InChI InChI=1S/C20H19ClF3N3O2S/c1-30(28,29)26-9-8-17(13-26)27(16-7-6-14(11-25)19(21)10-16)12-15-4-2-3-5-18(15)20(22,23)24/h2-7,10,17H,8-9,12-13H2,1H3/t17-/m0/s1
n/an/a 1.50E+4n/an/an/an/an/an/a
GlaxoSmithKline Pharmaceuticals
Curated by ChEMBL
Assay Description
Inhibition of CYP2D6
Bioorg Med Chem Lett 20: 371-4 (2010)
Article DOI: 10.1016/j.bmcl.2009.10.092
BindingDB Entry DOI: 10.7270/Q2057G17
Progesterone receptor
(Homo sapiens (Human))
BDBM50304964
((S)-2-chloro-4-((1-(methylsulfonyl)pyrrolidin-3-yl...)
Show SMILES CS(=O)(=O)N1CC[C@@H](C1)N(Cc1ccccc1C(F)(F)F)c1ccc(C#N)c(Cl)c1 |r|
Show InChI InChI=1S/C20H19ClF3N3O2S/c1-30(28,29)26-9-8-17(13-26)27(16-7-6-14(11-25)19(21)10-16)12-15-4-2-3-5-18(15)20(22,23)24/h2-7,10,17H,8-9,12-13H2,1H3/t17-/m0/s1
n/an/a 13n/an/an/an/an/an/a
GlaxoSmithKline Pharmaceuticals
Curated by ChEMBL
Assay Description
Inhibition of PR
Bioorg Med Chem Lett 20: 371-4 (2010)
Article DOI: 10.1016/j.bmcl.2009.10.092
BindingDB Entry DOI: 10.7270/Q2057G17