BDBM50305067 4-(3-(3-(isopropylsulfonyl)phenoxy)phenyl)-8-(trifluoromethyl)quinoline::CHEMBL595344
SMILES: CC(C)S(=O)(=O)c1cccc(Oc2cccc(c2)-c2ccnc3c(cccc23)C(F)(F)F)c1
InChI Key: InChIKey=MOQUFKNADUILIJ-UHFFFAOYSA-N
Data: 2 IC50
Activity Spreadsheet -- Enzyme Inhibition Constant Data from BindingDB
Found 2 hits for monomerid = 50305067
Trg + Lig
Ki
nM
ΔG°
kcal/mole
IC50
nM
Kd
nM
EC50/IC50
nM
koff
s-1
kon
M-1s-1
pHTemp
°C
Oxysterols receptor LXR-alpha
(Homo sapiens (Human))
BDBM50305067
(4-(3-(3-(isopropylsulfonyl)phenoxy)phenyl)-8-(trif...)
Show SMILES CC(C)S(=O)(=O)c1cccc(Oc2cccc(c2)-c2ccnc3c(cccc23)C(F)(F)F)c1
Show InChI InChI=1S/C25H20F3NO3S/c1-16(2)33(30,31)20-9-4-8-19(15-20)32-18-7-3-6-17(14-18)21-12-13-29-24-22(21)10-5-11-23(24)25(26,27)28/h3-16H,1-2H3
NCI pathway
Reactome pathway
n/an/a 2.40n/an/an/an/an/an/a
Wyeth Pharmaceuticals
Curated by ChEMBL
Assay Description
Displacement of [3H]T0901317 from human recombinant LXRalpha-LBD
Bioorg Med Chem Lett 20: 209-12 (2010)
Article DOI: 10.1016/j.bmcl.2009.10.132
BindingDB Entry DOI: 10.7270/Q2KW5G4B
Oxysterols receptor LXR-beta
(Homo sapiens (Human))
BDBM50305067
(4-(3-(3-(isopropylsulfonyl)phenoxy)phenyl)-8-(trif...)
Show SMILES CC(C)S(=O)(=O)c1cccc(Oc2cccc(c2)-c2ccnc3c(cccc23)C(F)(F)F)c1
Show InChI InChI=1S/C25H20F3NO3S/c1-16(2)33(30,31)20-9-4-8-19(15-20)32-18-7-3-6-17(14-18)21-12-13-29-24-22(21)10-5-11-23(24)25(26,27)28/h3-16H,1-2H3
n/an/a 4n/an/an/an/an/an/a
Wyeth Pharmaceuticals
Curated by ChEMBL
Assay Description
Displacement of [3H]T0901317 from human recombinant LXRbeta-LBD
Bioorg Med Chem Lett 20: 209-12 (2010)
Article DOI: 10.1016/j.bmcl.2009.10.132
BindingDB Entry DOI: 10.7270/Q2KW5G4B