null
SMILES: Oc1ccc(C2Nc3ccccc3-c3ccnc4[nH]cc2c34)c(Cl)c1
InChI Key: InChIKey=GWQOJNLUSACQPH-UHFFFAOYSA-N
Activity Spreadsheet -- Enzyme Inhibition Constant Data from BindingDB
Found 2 hits for monomerid = 50305152
Trg + Lig
Ki
nM
ΔG°
kcal/mole
IC50
nM
Kd
nM
EC50/IC50
nM
koff
s-1
kon
M-1s-1
pHTemp
°C
Tyrosine-protein kinase JAK2
(Homo sapiens (Human))
BDBM50305152
(3-chloro-4-{8,12,14-triazatetracyclo[8.6.1.0^{2,7}...)
Show SMILES Oc1ccc(C2Nc3ccccc3-c3ccnc4[nH]cc2c34)c(Cl)c1
Show InChI InChI=1S/C20H14ClN3O/c21-16-9-11(25)5-6-14(16)19-15-10-23-20-18(15)13(7-8-22-20)12-3-1-2-4-17(12)24-19/h1-10,19,24-25H,(H,22,23)
Reactome pathway
4n/an/an/an/an/an/an/an/a
Vertex Pharmaceuticals Inc.
Curated by ChEMBL
Assay Description
Inhibition of JAK2 by radiometric assay
Bioorg Med Chem Lett 20: 153-6 (2010)
Article DOI: 10.1016/j.bmcl.2009.11.021
BindingDB Entry DOI: 10.7270/Q2PN95RQ
Tyrosine-protein kinase JAK2
(Homo sapiens (Human))
BDBM50305152
(3-chloro-4-{8,12,14-triazatetracyclo[8.6.1.0^{2,7}...)
Show SMILES Oc1ccc(C2Nc3ccccc3-c3ccnc4[nH]cc2c34)c(Cl)c1
Show InChI InChI=1S/C20H14ClN3O/c21-16-9-11(25)5-6-14(16)19-15-10-23-20-18(15)13(7-8-22-20)12-3-1-2-4-17(12)24-19/h1-10,19,24-25H,(H,22,23)
Reactome pathway
n/an/a 5.60E+3n/an/an/an/an/an/a
Vertex Pharmaceuticals Inc.
Curated by ChEMBL
Assay Description
Inhibition of JAK2 in granulocyte macrophage colony stimulating factor-stimulated human TF1 cells assessed as phosphorylation of STAT5
Bioorg Med Chem Lett 20: 153-6 (2010)
Article DOI: 10.1016/j.bmcl.2009.11.021
BindingDB Entry DOI: 10.7270/Q2PN95RQ