BDBM50305377 3-[3-Oxo-3-((3bS,4aR)-3,4,4-trimethyl-3b,4,4a,5-tetrahydro-cyclopropa[3,4]cyclopenta[1,2-c]pyrazol-1-yl)-propenyl]-benzenesulfonamide::CHEMBL590135
SMILES: Cc1nn(C(=O)\C=C\c2cccc(c2)S(N)(=O)=O)c2C[C@@H]3[C@H](c12)C3(C)C
InChI Key: InChIKey=PUTFWTSPTVZYFR-WXVPVVBVSA-N
Data: 4 EC50
Activity Spreadsheet -- Enzyme Inhibition Constant Data from BindingDB
Found 4 hits for monomerid = 50305377
Trg + Lig
Ki
nM
ΔG°
kcal/mole
IC50
nM
Kd
nM
EC50/IC50
nM
koff
s-1
kon
M-1s-1
pHTemp
°C
Sphingosine 1-phosphate receptor 1
(Homo sapiens (Human))
BDBM50305377
(3-[3-Oxo-3-((3bS,4aR)-3,4,4-trimethyl-3b,4,4a,5-te...)
Show SMILES Cc1nn(C(=O)\C=C\c2cccc(c2)S(N)(=O)=O)c2C[C@@H]3[C@H](c12)C3(C)C |r|
Show InChI InChI=1S/C19H21N3O3S/c1-11-17-15(10-14-18(17)19(14,2)3)22(21-11)16(23)8-7-12-5-4-6-13(9-12)26(20,24)25/h4-9,14,18H,10H2,1-3H3,(H2,20,24,25)/b8-7+/t14-,18-/m1/s1
Reactome pathway
n/an/an/an/a 11n/an/an/an/a
Novartis Institutes for BioMedical Research
Curated by ChEMBL
Assay Description
Agonist activity at human SIP1 receptor expressed in CHO cells by [35S]GTPgammaS binding assay
Bioorg Med Chem Lett 20: 35-7 (2010)
Article DOI: 10.1016/j.bmcl.2009.11.045
BindingDB Entry DOI: 10.7270/Q2D79BH1
Sphingosine 1-phosphate receptor 5
(Homo sapiens (Human))
BDBM50305377
(3-[3-Oxo-3-((3bS,4aR)-3,4,4-trimethyl-3b,4,4a,5-te...)
Show SMILES Cc1nn(C(=O)\C=C\c2cccc(c2)S(N)(=O)=O)c2C[C@@H]3[C@H](c12)C3(C)C |r|
Show InChI InChI=1S/C19H21N3O3S/c1-11-17-15(10-14-18(17)19(14,2)3)22(21-11)16(23)8-7-12-5-4-6-13(9-12)26(20,24)25/h4-9,14,18H,10H2,1-3H3,(H2,20,24,25)/b8-7+/t14-,18-/m1/s1
NCI pathway
Reactome pathway
n/an/an/an/a 82n/an/an/an/a
Novartis Institutes for BioMedical Research
Curated by ChEMBL
Assay Description
Agonist activity at human SIP5 receptor by [35S]GTPgammaS binding assay
Bioorg Med Chem Lett 20: 35-7 (2010)
Article DOI: 10.1016/j.bmcl.2009.11.045
BindingDB Entry DOI: 10.7270/Q2D79BH1
Sphingosine 1-phosphate receptor 4
(Homo sapiens (Human))
BDBM50305377
(3-[3-Oxo-3-((3bS,4aR)-3,4,4-trimethyl-3b,4,4a,5-te...)
Show SMILES Cc1nn(C(=O)\C=C\c2cccc(c2)S(N)(=O)=O)c2C[C@@H]3[C@H](c12)C3(C)C |r|
Show InChI InChI=1S/C19H21N3O3S/c1-11-17-15(10-14-18(17)19(14,2)3)22(21-11)16(23)8-7-12-5-4-6-13(9-12)26(20,24)25/h4-9,14,18H,10H2,1-3H3,(H2,20,24,25)/b8-7+/t14-,18-/m1/s1
NCI pathway
Reactome pathway
n/an/an/an/a 116n/an/an/an/a
Novartis Institutes for BioMedical Research
Curated by ChEMBL
Assay Description
Agonist activity at human SIP4 receptor by [35S]GTPgammaS binding assay
Bioorg Med Chem Lett 20: 35-7 (2010)
Article DOI: 10.1016/j.bmcl.2009.11.045
BindingDB Entry DOI: 10.7270/Q2D79BH1
Sphingosine 1-phosphate receptor 3
(Homo sapiens (Human))
BDBM50305377
(3-[3-Oxo-3-((3bS,4aR)-3,4,4-trimethyl-3b,4,4a,5-te...)
Show SMILES Cc1nn(C(=O)\C=C\c2cccc(c2)S(N)(=O)=O)c2C[C@@H]3[C@H](c12)C3(C)C |r|
Show InChI InChI=1S/C19H21N3O3S/c1-11-17-15(10-14-18(17)19(14,2)3)22(21-11)16(23)8-7-12-5-4-6-13(9-12)26(20,24)25/h4-9,14,18H,10H2,1-3H3,(H2,20,24,25)/b8-7+/t14-,18-/m1/s1
NCI pathway
Reactome pathway
n/an/an/an/a 1.35E+3n/an/an/an/a
Novartis Institutes for BioMedical Research
Curated by ChEMBL
Assay Description
Agonist activity at human SIP3 receptor by [35S]GTPgammaS binding assay
Bioorg Med Chem Lett 20: 35-7 (2010)
Article DOI: 10.1016/j.bmcl.2009.11.045
BindingDB Entry DOI: 10.7270/Q2D79BH1