BDBM50305389 2-(1-(2-chlorophenyl)-5-(4-chlorophenyl)-3-(2-(4-fluorophenyl)pyrrolidine-1-carbonyl)-1H-pyrazol-4-yl)acetonitrile::CHEMBL592287
SMILES: Fc1ccc(cc1)C1CCCN1C(=O)c1nn(c(c1CC#N)-c1ccc(Cl)cc1)-c1ccccc1Cl
InChI Key: InChIKey=JNYPFLGHBZFJQG-UHFFFAOYSA-N
Data: 1 IC50
Activity Spreadsheet -- Enzyme Inhibition Constant Data from BindingDB
Found 1 hit for monomerid = 50305389
Trg + Lig
Ki
nM
ΔG°
kcal/mole
IC50
nM
Kd
nM
EC50/IC50
nM
koff
s-1
kon
M-1s-1
pHTemp
°C
Cannabinoid receptor 1
(Homo sapiens (Human))
BDBM50305389
(2-(1-(2-chlorophenyl)-5-(4-chlorophenyl)-3-(2-(4-f...)
Show SMILES Fc1ccc(cc1)C1CCCN1C(=O)c1nn(c(c1CC#N)-c1ccc(Cl)cc1)-c1ccccc1Cl
Show InChI InChI=1S/C28H21Cl2FN4O/c29-20-11-7-19(8-12-20)27-22(15-16-32)26(33-35(27)25-5-2-1-4-23(25)30)28(36)34-17-3-6-24(34)18-9-13-21(31)14-10-18/h1-2,4-5,7-14,24H,3,6,15,17H2
NCI pathway
Reactome pathway
n/an/a 27n/an/an/an/an/an/a
7TM Pharma A/S
Curated by ChEMBL
Assay Description
Antagonist activity at human recombinant CB1 receptor expressed in CHO-K1 cells assessed as inhibition of CP55940-stimulated GTPgammaS binding
Bioorg Med Chem Lett 20: 26-30 (2010)
Article DOI: 10.1016/j.bmcl.2009.11.047
BindingDB Entry DOI: 10.7270/Q28G8KS9