BDBM50305415 1-(2-chlorophenyl)-5-(4-chlorophenyl)-4-(cyanomethyl)-N-(2,3-dihydro-1H-inden-1-yl)-1H-pyrazole-3-carboxamide::CHEMBL589398
SMILES: Clc1ccc(cc1)-c1c(CC#N)c(nn1-c1ccccc1Cl)C(=O)NC1CCc2ccccc12
InChI Key: InChIKey=OZZVGHKEPQBHOZ-UHFFFAOYSA-N
Data: 1 IC50
Activity Spreadsheet -- Enzyme Inhibition Constant Data from BindingDB
Found 1 hit for monomerid = 50305415
Trg + Lig
Ki
nM
ΔG°
kcal/mole
IC50
nM
Kd
nM
EC50/IC50
nM
koff
s-1
kon
M-1s-1
pHTemp
°C
Cannabinoid receptor 1
(Homo sapiens (Human))
BDBM50305415
(1-(2-chlorophenyl)-5-(4-chlorophenyl)-4-(cyanometh...)
Show SMILES Clc1ccc(cc1)-c1c(CC#N)c(nn1-c1ccccc1Cl)C(=O)NC1CCc2ccccc12
Show InChI InChI=1S/C27H20Cl2N4O/c28-19-12-9-18(10-13-19)26-21(15-16-30)25(32-33(26)24-8-4-3-7-22(24)29)27(34)31-23-14-11-17-5-1-2-6-20(17)23/h1-10,12-13,23H,11,14-15H2,(H,31,34)
NCI pathway
Reactome pathway
n/an/a 0.410n/an/an/an/an/an/a
7TM Pharma A/S
Curated by ChEMBL
Assay Description
Antagonist activity at human recombinant CB1 receptor expressed in CHO-K1 cells assessed as inhibition of CP55940-stimulated GTPgammaS binding
Bioorg Med Chem Lett 20: 26-30 (2010)
Article DOI: 10.1016/j.bmcl.2009.11.047
BindingDB Entry DOI: 10.7270/Q28G8KS9