null
SMILES: COc1sc(cc1C)S(=O)(=O)NC(=O)Nc1ncc(Br)s1
InChI Key: InChIKey=CSJISBZQKAOPMI-UHFFFAOYSA-N
Activity Spreadsheet -- Enzyme Inhibition Constant Data from BindingDB
Found 3 hits for monomerid = 50305561
Trg + Lig
Ki
nM
ΔG°
kcal/mole
IC50
nM
Kd
nM
EC50/IC50
nM
koff
s-1
kon
M-1s-1
pHTemp
°C
Fructose-1,6-bisphosphatase 1
(Homo sapiens (Human))
BDBM50305561
(CHEMBL593282 | N-(5-bromothiazol-2-ylcarbamoyl)-5-...)
Show SMILES COc1sc(cc1C)S(=O)(=O)NC(=O)Nc1ncc(Br)s1
Show InChI InChI=1S/C10H10BrN3O4S3/c1-5-3-7(20-8(5)18-2)21(16,17)14-9(15)13-10-12-4-6(11)19-10/h3-4H,1-2H3,(H2,12,13,14,15)
n/an/a 150n/an/an/an/an/an/a
F. Hoffmann-La Roche Ltd
Curated by ChEMBL
Assay Description
Inhibition of FBPase in human liver
Bioorg Med Chem Lett 20: 594-9 (2010)
Article DOI: 10.1016/j.bmcl.2009.11.093
BindingDB Entry DOI: 10.7270/Q27H1JPX
Fructose-1,6-bisphosphatase 1
(Mus musculus)
BDBM50305561
(CHEMBL593282 | N-(5-bromothiazol-2-ylcarbamoyl)-5-...)
Show SMILES COc1sc(cc1C)S(=O)(=O)NC(=O)Nc1ncc(Br)s1
Show InChI InChI=1S/C10H10BrN3O4S3/c1-5-3-7(20-8(5)18-2)21(16,17)14-9(15)13-10-12-4-6(11)19-10/h3-4H,1-2H3,(H2,12,13,14,15)
Reactome pathway
n/an/an/an/a 2.40E+4n/an/an/an/a
F. Hoffmann-La Roche Ltd
Curated by ChEMBL
Assay Description
Inhibition of FBPase in mouse liver
Bioorg Med Chem Lett 20: 594-9 (2010)
Article DOI: 10.1016/j.bmcl.2009.11.093
BindingDB Entry DOI: 10.7270/Q27H1JPX
Fructose-1,6-bisphosphatase 1
(Homo sapiens (Human))
BDBM50305561
(CHEMBL593282 | N-(5-bromothiazol-2-ylcarbamoyl)-5-...)
Show SMILES COc1sc(cc1C)S(=O)(=O)NC(=O)Nc1ncc(Br)s1
Show InChI InChI=1S/C10H10BrN3O4S3/c1-5-3-7(20-8(5)18-2)21(16,17)14-9(15)13-10-12-4-6(11)19-10/h3-4H,1-2H3,(H2,12,13,14,15)
n/an/a 70n/an/an/an/an/an/a
F. Hoffmann-La Roche Ltd
Curated by ChEMBL
Assay Description
Inhibition of FBPase in human liver using fructose-2,6phosphate as a substrate
Bioorg Med Chem Lett 20: 594-9 (2010)
Article DOI: 10.1016/j.bmcl.2009.11.093
BindingDB Entry DOI: 10.7270/Q27H1JPX