null
SMILES: OC(=O)[C@@H](Cc1nc2ccccc2[nH]1)NC(=O)CCc1cc2ccccc2[nH]1
InChI Key: InChIKey=ZHWBKERXDYLTJJ-GOSISDBHSA-N
Activity Spreadsheet -- Enzyme Inhibition Constant Data from BindingDB
Found 1 hit for monomerid = 50305671
Trg + Lig
Ki
nM
ΔG°
kcal/mole
IC50
nM
Kd
nM
EC50/IC50
nM
koff
s-1
kon
M-1s-1
pHTemp
°C
Peptidyl-prolyl cis-trans isomerase NIMA-interacting 1
(Homo sapiens (Human))
BDBM50305671
((R)-2-(3-(1H-indol-2-yl)propanamido)-3-(1H-benzo[d...)
Show SMILES OC(=O)[C@@H](Cc1nc2ccccc2[nH]1)NC(=O)CCc1cc2ccccc2[nH]1 |r|
Show InChI InChI=1S/C21H20N4O3/c26-20(10-9-14-11-13-5-1-2-6-15(13)22-14)25-18(21(27)28)12-19-23-16-7-3-4-8-17(16)24-19/h1-8,11,18,22H,9-10,12H2,(H,23,24)(H,25,26)(H,27,28)/t18-/m1/s1
NCI pathway
Reactome pathway
n/an/a 6.30E+3n/an/an/an/an/an/a
Vernalis (R&D) Ltd
Curated by ChEMBL
Assay Description
Inhibition of 8His-tagged Pin1 PPIase domain (45-163)
Bioorg Med Chem Lett 20: 586-90 (2010)
Article DOI: 10.1016/j.bmcl.2009.11.090
BindingDB Entry DOI: 10.7270/Q2QJ7HDW