null
SMILES: COc1ccc(cc1)-c1cc(C(=O)N[C@H](Cc2nc3ccccc3[nH]2)C(O)=O)c(C)o1
InChI Key: InChIKey=AXQQYBVKSOBJAU-LJQANCHMSA-N
Activity Spreadsheet -- Enzyme Inhibition Constant Data from BindingDB
Found 1 hit for monomerid = 50305675
Trg + Lig
Ki
nM
ΔG°
kcal/mole
IC50
nM
Kd
nM
EC50/IC50
nM
koff
s-1
kon
M-1s-1
pHTemp
°C
Peptidyl-prolyl cis-trans isomerase NIMA-interacting 1
(Homo sapiens (Human))
BDBM50305675
((R)-3-(1H-benzo[d]imidazol-2-yl)-2-(5-(4-methoxyph...)
Show SMILES COc1ccc(cc1)-c1cc(C(=O)N[C@H](Cc2nc3ccccc3[nH]2)C(O)=O)c(C)o1 |r|
Show InChI InChI=1S/C23H21N3O5/c1-13-16(11-20(31-13)14-7-9-15(30-2)10-8-14)22(27)26-19(23(28)29)12-21-24-17-5-3-4-6-18(17)25-21/h3-11,19H,12H2,1-2H3,(H,24,25)(H,26,27)(H,28,29)/t19-/m1/s1
NCI pathway
Reactome pathway
n/an/a 130n/an/an/an/an/an/a
Vernalis (R&D) Ltd
Curated by ChEMBL
Assay Description
Inhibition of 8His-tagged Pin1 PPIase domain (45-163)
Bioorg Med Chem Lett 20: 586-90 (2010)
Article DOI: 10.1016/j.bmcl.2009.11.090
BindingDB Entry DOI: 10.7270/Q2QJ7HDW