null
SMILES: COc1ccc(cc1)-c1cc(C(=O)N[C@H](Cc2ccc3ccccc3c2)C(O)=O)c(C)o1
InChI Key: InChIKey=VXXTXOXICOOAFL-HSZRJFAPSA-N
Activity Spreadsheet -- Enzyme Inhibition Constant Data from BindingDB
Found 1 hit for monomerid = 50305681
Trg + Lig
Ki
nM
ΔG°
kcal/mole
IC50
nM
Kd
nM
EC50/IC50
nM
koff
s-1
kon
M-1s-1
pHTemp
°C
Peptidyl-prolyl cis-trans isomerase NIMA-interacting 1
(Homo sapiens (Human))
BDBM50305681
((R)-2-(5-(4-methoxyphenyl)-2-methylfuran-3-carboxa...)
Show SMILES COc1ccc(cc1)-c1cc(C(=O)N[C@H](Cc2ccc3ccccc3c2)C(O)=O)c(C)o1 |r|
Show InChI InChI=1S/C26H23NO5/c1-16-22(15-24(32-16)19-9-11-21(31-2)12-10-19)25(28)27-23(26(29)30)14-17-7-8-18-5-3-4-6-20(18)13-17/h3-13,15,23H,14H2,1-2H3,(H,27,28)(H,29,30)/t23-/m1/s1
NCI pathway
Reactome pathway
n/an/a 2.60E+3n/an/an/an/an/an/a
Vernalis (R&D) Ltd
Curated by ChEMBL
Assay Description
Inhibition of 8His-tagged Pin1 PPIase domain (45-163)
Bioorg Med Chem Lett 20: 586-90 (2010)
Article DOI: 10.1016/j.bmcl.2009.11.090
BindingDB Entry DOI: 10.7270/Q2QJ7HDW