BDBM50305692 3-tert-butyl-6-(2,4-difluorophenylthio)-[1,2,4]triazolo[4,3-a]pyridine hydrochloride::CHEMBL1198626::CHEMBL609275
SMILES: CC(C)(C)c1nnc2ccc(Sc3ccc(F)cc3F)cn12
InChI Key: InChIKey=QBRGSYLNUUOUBB-UHFFFAOYSA-N
Data: 2 IC50
Activity Spreadsheet -- Enzyme Inhibition Constant Data from BindingDB
Found 2 hits for monomerid = 50305692
Trg + Lig
Ki
nM
ΔG°
kcal/mole
IC50
nM
Kd
nM
EC50/IC50
nM
koff
s-1
kon
M-1s-1
pHTemp
°C
Mitogen-activated protein kinase 13 (MAPK13)
(Homo sapiens (Human))
BDBM50305692
(3-tert-butyl-6-(2,4-difluorophenylthio)-[1,2,4]tri...)
Show SMILES CC(C)(C)c1nnc2ccc(Sc3ccc(F)cc3F)cn12
Show InChI InChI=1S/C16H15F2N3S/c1-16(2,3)15-20-19-14-7-5-11(9-21(14)15)22-13-6-4-10(17)8-12(13)18/h4-9H,1-3H3
Reactome pathway
n/an/a 62n/an/an/an/an/an/a
Rhône-Poulenc Rorer
Curated by ChEMBL
Assay Description
Inhibition of p38alpha
Bioorg Med Chem Lett 22: 3431-6 (2012)
Article DOI: 10.1016/j.bmcl.2012.03.099
BindingDB Entry DOI: 10.7270/Q2348MNX
Mitogen-activated protein kinase 14
(Homo sapiens (Human))
BDBM50305692
(3-tert-butyl-6-(2,4-difluorophenylthio)-[1,2,4]tri...)
Show SMILES CC(C)(C)c1nnc2ccc(Sc3ccc(F)cc3F)cn12
Show InChI InChI=1S/C16H15F2N3S/c1-16(2,3)15-20-19-14-7-5-11(9-21(14)15)22-13-6-4-10(17)8-12(13)18/h4-9H,1-3H3
NCI pathway
Reactome pathway
n/an/a 4.80n/an/an/an/an/an/a
Pfizer Global Research and Development
Curated by ChEMBL
Assay Description
Inhibition of p38 alpha
Bioorg Med Chem Lett 20: 469-73 (2010)
Article DOI: 10.1016/j.bmcl.2009.11.114
BindingDB Entry DOI: 10.7270/Q2G160XP