BDBM50305694 6-(2,4-difluorophenylthio)-3-(2-methylpent-4-en-2-yl)-[1,2,4]triazolo[4,3-a]pyridine hydrochloride::CHEMBL611945
SMILES: CC(C)(CC=C)c1nnc2ccc(Sc3ccc(F)cc3F)cn12
InChI Key: InChIKey=RTLUPRCLMIZMEX-UHFFFAOYSA-N
Data: 1 IC50
Activity Spreadsheet -- Enzyme Inhibition Constant Data from BindingDB
Found 1 hit for monomerid = 50305694
Trg + Lig
Ki
nM
ΔG°
kcal/mole
IC50
nM
Kd
nM
EC50/IC50
nM
koff
s-1
kon
M-1s-1
pHTemp
°C
Mitogen-activated protein kinase 14
(Homo sapiens (Human))
BDBM50305694
(6-(2,4-difluorophenylthio)-3-(2-methylpent-4-en-2-...)
Show SMILES CC(C)(CC=C)c1nnc2ccc(Sc3ccc(F)cc3F)cn12
Show InChI InChI=1S/C18H17F2N3S/c1-4-9-18(2,3)17-22-21-16-8-6-13(11-23(16)17)24-15-7-5-12(19)10-14(15)20/h4-8,10-11H,1,9H2,2-3H3
NCI pathway
Reactome pathway
n/an/a 16.3n/an/an/an/an/an/a
Pfizer Global Research and Development
Curated by ChEMBL
Assay Description
Inhibition of p38 alpha
Bioorg Med Chem Lett 20: 469-73 (2010)
Article DOI: 10.1016/j.bmcl.2009.11.114
BindingDB Entry DOI: 10.7270/Q2G160XP