BDBM50305707 3-(6-(2,4-difluorophenylthio)-[1,2,4]triazolo[4,3-a]pyridin-3-yl)-N,4-dimethylbenzamide hydrochloride::CHEMBL593459
SMILES: CNC(=O)c1ccc(C)c(c1)-c1nnc2ccc(Sc3ccc(F)cc3F)cn12
InChI Key: InChIKey=SIKKUKPHFOGWLT-UHFFFAOYSA-N
Data: 1 IC50
Activity Spreadsheet -- Enzyme Inhibition Constant Data from BindingDB
Found 1 hit for monomerid = 50305707
Trg + Lig
Ki
nM
ΔG°
kcal/mole
IC50
nM
Kd
nM
EC50/IC50
nM
koff
s-1
kon
M-1s-1
pHTemp
°C
Mitogen-activated protein kinase 14
(Homo sapiens (Human))
BDBM50305707
(3-(6-(2,4-difluorophenylthio)-[1,2,4]triazolo[4,3-...)
Show SMILES CNC(=O)c1ccc(C)c(c1)-c1nnc2ccc(Sc3ccc(F)cc3F)cn12
Show InChI InChI=1S/C21H16F2N4OS/c1-12-3-4-13(21(28)24-2)9-16(12)20-26-25-19-8-6-15(11-27(19)20)29-18-7-5-14(22)10-17(18)23/h3-11H,1-2H3,(H,24,28)
NCI pathway
Reactome pathway
n/an/a 39.9n/an/an/an/an/an/a
Pfizer Global Research and Development
Curated by ChEMBL
Assay Description
Inhibition of p38 alpha
Bioorg Med Chem Lett 20: 469-73 (2010)
Article DOI: 10.1016/j.bmcl.2009.11.114
BindingDB Entry DOI: 10.7270/Q2G160XP