BDBM50305708 CHEMBL603640::N-(2-amino-2-oxoethyl)-3-(6-(2,4-difluorophenylthio)-[1,2,4]triazolo[4,3-a]pyridin-3-yl)-4-methylbenzamide hydrochloride
SMILES: Cc1ccc(cc1-c1nnc2ccc(Sc3ccc(F)cc3F)cn12)C(=O)NCC(N)=O
InChI Key: InChIKey=GLANOUVXCLNGEG-UHFFFAOYSA-N
Data: 1 IC50
Activity Spreadsheet -- Enzyme Inhibition Constant Data from BindingDB
Found 1 hit for monomerid = 50305708
Trg + Lig
Ki
nM
ΔG°
kcal/mole
IC50
nM
Kd
nM
EC50/IC50
nM
koff
s-1
kon
M-1s-1
pHTemp
°C
Mitogen-activated protein kinase 14
(Homo sapiens (Human))
BDBM50305708
(CHEMBL603640 | N-(2-amino-2-oxoethyl)-3-(6-(2,4-di...)
Show SMILES Cc1ccc(cc1-c1nnc2ccc(Sc3ccc(F)cc3F)cn12)C(=O)NCC(N)=O
Show InChI InChI=1S/C22H17F2N5O2S/c1-12-2-3-13(22(31)26-10-19(25)30)8-16(12)21-28-27-20-7-5-15(11-29(20)21)32-18-6-4-14(23)9-17(18)24/h2-9,11H,10H2,1H3,(H2,25,30)(H,26,31)
NCI pathway
Reactome pathway
n/an/a 46.5n/an/an/an/an/an/a
Pfizer Global Research and Development
Curated by ChEMBL
Assay Description
Inhibition of p38 alpha
Bioorg Med Chem Lett 20: 469-73 (2010)
Article DOI: 10.1016/j.bmcl.2009.11.114
BindingDB Entry DOI: 10.7270/Q2G160XP