BDBM50305720 5-chloro-6-(2,4-difluorophenylthio)-3-isopropyl-[1,2,4]triazolo[4,3-a]pyridine::CHEMBL594839
SMILES: CC(C)c1nnc2ccc(Sc3ccc(F)cc3F)c(Cl)n12
InChI Key: InChIKey=XDFGHQBNCYQDDN-UHFFFAOYSA-N
Data: 1 IC50
Activity Spreadsheet -- Enzyme Inhibition Constant Data from BindingDB
Found 1 hit for monomerid = 50305720
Trg + Lig
Ki
nM
ΔG°
kcal/mole
IC50
nM
Kd
nM
EC50/IC50
nM
koff
s-1
kon
M-1s-1
pHTemp
°C
Mitogen-activated protein kinase 14
(Homo sapiens (Human))
BDBM50305720
(5-chloro-6-(2,4-difluorophenylthio)-3-isopropyl-[1...)
Show SMILES CC(C)c1nnc2ccc(Sc3ccc(F)cc3F)c(Cl)n12
Show InChI InChI=1S/C15H12ClF2N3S/c1-8(2)15-20-19-13-6-5-12(14(16)21(13)15)22-11-4-3-9(17)7-10(11)18/h3-8H,1-2H3
NCI pathway
Reactome pathway
n/an/a 12.3n/an/an/an/an/an/a
Pfizer Global Research and Development
Curated by ChEMBL
Assay Description
Inhibition of p38 alpha
Bioorg Med Chem Lett 20: 469-73 (2010)
Article DOI: 10.1016/j.bmcl.2009.11.114
BindingDB Entry DOI: 10.7270/Q2G160XP