BDBM50305729 6-(2,4-difluorobenzyl)-3-isopropyl-1,8a-dihydro-[1,2,4]triazolo[4,3-a]pyridine::CHEMBL607557
SMILES: CC(C)c1nnc2CCC(Cc3ccc(F)cc3F)=Cn12
InChI Key: InChIKey=YRPJIXXEFSPLAG-UHFFFAOYSA-N
Data: 1 IC50
Activity Spreadsheet -- Enzyme Inhibition Constant Data from BindingDB
Found 1 hit for monomerid = 50305729
Trg + Lig
Ki
nM
ΔG°
kcal/mole
IC50
nM
Kd
nM
EC50/IC50
nM
koff
s-1
kon
M-1s-1
pHTemp
°C
Mitogen-activated protein kinase 14
(Homo sapiens (Human))
BDBM50305729
(6-(2,4-difluorobenzyl)-3-isopropyl-1,8a-dihydro-[1...)
Show SMILES CC(C)c1nnc2CCC(Cc3ccc(F)cc3F)=Cn12 |c:19|
Show InChI InChI=1S/C16H17F2N3/c1-10(2)16-20-19-15-6-3-11(9-21(15)16)7-12-4-5-13(17)8-14(12)18/h4-5,8-10H,3,6-7H2,1-2H3
NCI pathway
Reactome pathway
n/an/a 26.1n/an/an/an/an/an/a
Pfizer Global Research and Development
Curated by ChEMBL
Assay Description
Inhibition of p38 alpha
Bioorg Med Chem Lett 20: 469-73 (2010)
Article DOI: 10.1016/j.bmcl.2009.11.114
BindingDB Entry DOI: 10.7270/Q2G160XP