null
SMILES: NC[C@]1(CC(O)=O)CC2CCCC12
InChI Key: InChIKey=JXSBZOVCVUSLIO-SFVIPPHHSA-N
Activity Spreadsheet -- Enzyme Inhibition Constant Data from BindingDB
Found 1 hit for monomerid = 50305894
Trg + Lig
Ki
nM
ΔG°
kcal/mole
IC50
nM
Kd
nM
EC50/IC50
nM
koff
s-1
kon
M-1s-1
pHTemp
°C
Voltage-dependent calcium channel alpha-2 delta subunit
(Sus scrofa)
BDBM50305894
((+/-)-2-((6S)-6-(aminomethyl)bicyclo[3.2.0]heptan-...)
Show SMILES NC[C@]1(CC(O)=O)CC2CCCC12 |r|
Show InChI InChI=1S/C10H17NO2/c11-6-10(5-9(12)13)4-7-2-1-3-8(7)10/h7-8H,1-6,11H2,(H,12,13)/t7?,8?,10-/m1/s1
n/an/a 25n/an/an/an/an/an/a
Pfizer Global Research and Development
Curated by ChEMBL
Assay Description
Displacement of [3H]gabapentin from calcium channel alpha2delta in pig cerebral cortex membrane after 30 mins
Bioorg Med Chem Lett 20: 461-4 (2010)
Article DOI: 10.1016/j.bmcl.2009.11.118
BindingDB Entry DOI: 10.7270/Q25H7GCQ