BDBM50305901 (S)-2-(4-chlorophenyl)-N-(5-cyanothiazol-2-yl)-3-methylbutanamide::CHEMBL593839
SMILES: CC(C)[C@H](C(=O)Nc1ncc(s1)C#N)c1ccc(Cl)cc1
InChI Key: InChIKey=PRFPIGKRNUFSFS-ZDUSSCGKSA-N
Data: 1 IC50
Activity Spreadsheet -- Enzyme Inhibition Constant Data from BindingDB
Found 1 hit for monomerid = 50305901
Trg + Lig
Ki
nM
ΔG°
kcal/mole
IC50
nM
Kd
nM
EC50/IC50
nM
koff
s-1
kon
M-1s-1
pHTemp
°C
Free fatty acid receptor 2
(Homo sapiens (Human))
BDBM50305901
((S)-2-(4-chlorophenyl)-N-(5-cyanothiazol-2-yl)-3-m...)
Show SMILES CC(C)[C@H](C(=O)Nc1ncc(s1)C#N)c1ccc(Cl)cc1 |r|
Show InChI InChI=1S/C15H14ClN3OS/c1-9(2)13(10-3-5-11(16)6-4-10)14(20)19-15-18-8-12(7-17)21-15/h3-6,8-9,13H,1-2H3,(H,18,19,20)/t13-/m0/s1
Reactome pathway
n/an/a 2.00E+3n/an/an/an/an/an/a
Amgen Inc.
Curated by ChEMBL
Assay Description
Agonist activity at human FFA2 receptor expressed in CHO cells assessed as inhibition of forskolin-induced cAMP production
Bioorg Med Chem Lett 20: 493-8 (2010)
Article DOI: 10.1016/j.bmcl.2009.11.112
BindingDB Entry DOI: 10.7270/Q21V5F2Q