BDBM50305905 (S)-2-(4-chlorophenyl)-N-(5-chlorothiazol-2-yl)-3,3-dimethylbutanamide::CHEMBL610333
SMILES: CC(C)(C)[C@H](C(=O)Nc1ncc(Cl)s1)c1ccc(Cl)cc1
InChI Key: InChIKey=BGHIUGMVXLYQHX-LBPRGKRZSA-N
Data: 1 IC50
Activity Spreadsheet -- Enzyme Inhibition Constant Data from BindingDB
Found 1 hit for monomerid = 50305905
Trg + Lig
Ki
nM
ΔG°
kcal/mole
IC50
nM
Kd
nM
EC50/IC50
nM
koff
s-1
kon
M-1s-1
pHTemp
°C
Free fatty acid receptor 2
(Homo sapiens (Human))
BDBM50305905
((S)-2-(4-chlorophenyl)-N-(5-chlorothiazol-2-yl)-3,...)
Show SMILES CC(C)(C)[C@H](C(=O)Nc1ncc(Cl)s1)c1ccc(Cl)cc1 |r|
Show InChI InChI=1S/C15H16Cl2N2OS/c1-15(2,3)12(9-4-6-10(16)7-5-9)13(20)19-14-18-8-11(17)21-14/h4-8,12H,1-3H3,(H,18,19,20)/t12-/m0/s1
Reactome pathway
n/an/a 1.00E+3n/an/an/an/an/an/a
Amgen Inc.
Curated by ChEMBL
Assay Description
Agonist activity at human FFA2 receptor expressed in CHO cells assessed as inhibition of forskolin-induced cAMP production
Bioorg Med Chem Lett 20: 493-8 (2010)
Article DOI: 10.1016/j.bmcl.2009.11.112
BindingDB Entry DOI: 10.7270/Q21V5F2Q