BDBM50305911 (S)-2-(4-chlorophenyl)-3,3-dimethyl-N-(5-phenylthiazol-2-yl)butanamide::CHEMBL607315
SMILES: CC(C)(C)[C@H](C(=O)Nc1ncc(s1)-c1ccccc1)c1ccc(Cl)cc1
InChI Key: InChIKey=ZVAPEFXSRDIMFP-SFHVURJKSA-N
Data: 1 IC50
Activity Spreadsheet -- Enzyme Inhibition Constant Data from BindingDB
Found 1 hit for monomerid = 50305911
Trg + Lig
Ki
nM
ΔG°
kcal/mole
IC50
nM
Kd
nM
EC50/IC50
nM
koff
s-1
kon
M-1s-1
pHTemp
°C
Free fatty acid receptor 2
(Homo sapiens (Human))
BDBM50305911
((S)-2-(4-chlorophenyl)-3,3-dimethyl-N-(5-phenylthi...)
Show SMILES CC(C)(C)[C@H](C(=O)Nc1ncc(s1)-c1ccccc1)c1ccc(Cl)cc1 |r|
Show InChI InChI=1S/C21H21ClN2OS/c1-21(2,3)18(15-9-11-16(22)12-10-15)19(25)24-20-23-13-17(26-20)14-7-5-4-6-8-14/h4-13,18H,1-3H3,(H,23,24,25)/t18-/m0/s1
Reactome pathway
n/an/a 700n/an/an/an/an/an/a
Amgen Inc.
Curated by ChEMBL
Assay Description
Agonist activity at human FFA2 receptor expressed in CHO cells assessed as inhibition of forskolin-induced cAMP production
Bioorg Med Chem Lett 20: 493-8 (2010)
Article DOI: 10.1016/j.bmcl.2009.11.112
BindingDB Entry DOI: 10.7270/Q21V5F2Q