BDBM50305984 5,6-bis(4-chlorophenyl)-N-(4,4-difluorocyclohexyl)-3-(methoxymethyl)pyrazine-2-carbothioamide::CHEMBL605526
SMILES: COCc1nc(-c2ccc(Cl)cc2)c(nc1C(=S)NC1CCC(F)(F)CC1)-c1ccc(Cl)cc1
InChI Key: InChIKey=ZVFXKNSYECSLJW-UHFFFAOYSA-N
Data: 1 IC50
Activity Spreadsheet -- Enzyme Inhibition Constant Data from BindingDB
Found 1 hit for monomerid = 50305984
Trg + Lig
Ki
nM
ΔG°
kcal/mole
IC50
nM
Kd
nM
EC50/IC50
nM
koff
s-1
kon
M-1s-1
pHTemp
°C
Cannabinoid receptor 1
(Homo sapiens (Human))
BDBM50305984
(5,6-bis(4-chlorophenyl)-N-(4,4-difluorocyclohexyl)...)
Show SMILES COCc1nc(-c2ccc(Cl)cc2)c(nc1C(=S)NC1CCC(F)(F)CC1)-c1ccc(Cl)cc1
Show InChI InChI=1S/C25H23Cl2F2N3OS/c1-33-14-20-23(24(34)30-19-10-12-25(28,29)13-11-19)32-22(16-4-8-18(27)9-5-16)21(31-20)15-2-6-17(26)7-3-15/h2-9,19H,10-14H2,1H3,(H,30,34)
NCI pathway
Reactome pathway
n/an/a 2.40n/an/an/an/an/an/a
AstraZeneca R&D M£lndal
Curated by ChEMBL
Assay Description
Agonist activity at human CB1 receptor assessed as stimulation of [35S]GTPgammaS binding
Bioorg Med Chem Lett 20: 479-82 (2010)
Article DOI: 10.1016/j.bmcl.2009.11.125
BindingDB Entry DOI: 10.7270/Q2X34XKB