BDBM50305998 CHEMBL607032::N-((4-(aminomethyl)-1-(4-chloro-2-(2-fluorophenylsulfonyl)phenylsulfonyl)piperidin-4-yl)methyl)-1,1,1-trifluoromethanesulfonamide
SMILES: NCC1(CNS(=O)(=O)C(F)(F)F)CCN(CC1)S(=O)(=O)c1ccc(Cl)cc1S(=O)(=O)c1ccccc1F
InChI Key: InChIKey=CZASHIVCDLMKQD-UHFFFAOYSA-N
Data: 1 KI  1 IC50
Activity Spreadsheet -- Enzyme Inhibition Constant Data from BindingDB
Found 2 hits for monomerid = 50305998
Trg + Lig
Ki
nM
ΔG°
kcal/mole
IC50
nM
Kd
nM
EC50/IC50
nM
koff
s-1
kon
M-1s-1
pHTemp
°C
Cannabinoid receptor 2
(Homo sapiens (Human))
BDBM50305998
(CHEMBL607032 | N-((4-(aminomethyl)-1-(4-chloro-2-(...)
Show SMILES NCC1(CNS(=O)(=O)C(F)(F)F)CCN(CC1)S(=O)(=O)c1ccc(Cl)cc1S(=O)(=O)c1ccccc1F
Show InChI InChI=1S/C20H22ClF4N3O6S3/c21-14-5-6-17(18(11-14)35(29,30)16-4-2-1-3-15(16)22)36(31,32)28-9-7-19(12-26,8-10-28)13-27-37(33,34)20(23,24)25/h1-6,11,27H,7-10,12-13,26H2
Reactome pathway
203n/an/an/an/an/an/an/an/a
Merck Research Laboratories
Curated by ChEMBL
Assay Description
Binding affinity to human CB2 receptor
Bioorg Med Chem Lett 20: 608-11 (2010)
Article DOI: 10.1016/j.bmcl.2009.11.084
BindingDB Entry DOI: 10.7270/Q2SB45V0
Cytochrome P450 2C9
(Homo sapiens (Human))
BDBM50305998
(CHEMBL607032 | N-((4-(aminomethyl)-1-(4-chloro-2-(...)
Show SMILES NCC1(CNS(=O)(=O)C(F)(F)F)CCN(CC1)S(=O)(=O)c1ccc(Cl)cc1S(=O)(=O)c1ccccc1F
Show InChI InChI=1S/C20H22ClF4N3O6S3/c21-14-5-6-17(18(11-14)35(29,30)16-4-2-1-3-15(16)22)36(31,32)28-9-7-19(12-26,8-10-28)13-27-37(33,34)20(23,24)25/h1-6,11,27H,7-10,12-13,26H2
Reactome pathway
n/an/a 2.30E+4n/an/an/an/an/an/a
Merck Research Laboratories
Curated by ChEMBL
Assay Description
Inhibition of CYP2C9
Bioorg Med Chem Lett 20: 608-11 (2010)
Article DOI: 10.1016/j.bmcl.2009.11.084
BindingDB Entry DOI: 10.7270/Q2SB45V0