BDBM50306016 CHEMBL596579::N-(6-(4-chloro-2-(2-fluorophenylsulfonyl)phenylsulfonyl)-6-azaspiro[2.5]octan-1-yl)-1,1,1-trifluoromethanesulfonamide
SMILES: Fc1ccccc1S(=O)(=O)c1cc(Cl)ccc1S(=O)(=O)N1CCC2(CC2NS(=O)(=O)C(F)(F)F)CC1
InChI Key: InChIKey=YGHYLQCCZKDSKS-UHFFFAOYSA-N
Data: 4 KI  1 IC50
Activity Spreadsheet -- Enzyme Inhibition Constant Data from BindingDB
Found 5 hits for monomerid = 50306016
Trg + Lig
Ki
nM
ΔG°
kcal/mole
IC50
nM
Kd
nM
EC50/IC50
nM
koff
s-1
kon
M-1s-1
pHTemp
°C
Cannabinoid receptor 2
(Homo sapiens (Human))
BDBM50306016
(CHEMBL596579 | N-(6-(4-chloro-2-(2-fluorophenylsul...)
Show SMILES Fc1ccccc1S(=O)(=O)c1cc(Cl)ccc1S(=O)(=O)N1CCC2(CC2NS(=O)(=O)C(F)(F)F)CC1
Show InChI InChI=1S/C20H19ClF4N2O6S3/c21-13-5-6-16(17(11-13)34(28,29)15-4-2-1-3-14(15)22)35(30,31)27-9-7-19(8-10-27)12-18(19)26-36(32,33)20(23,24)25/h1-6,11,18,26H,7-10,12H2
Reactome pathway
1.70n/an/an/an/an/an/an/an/a
Merck Research Laboratories
Curated by ChEMBL
Assay Description
Binding affinity to human CB2 receptor
Bioorg Med Chem Lett 20: 608-11 (2010)
Article DOI: 10.1016/j.bmcl.2009.11.084
BindingDB Entry DOI: 10.7270/Q2SB45V0
Cannabinoid receptor 2
(Homo sapiens (Human))
BDBM50306016
(CHEMBL596579 | N-(6-(4-chloro-2-(2-fluorophenylsul...)
Show SMILES Fc1ccccc1S(=O)(=O)c1cc(Cl)ccc1S(=O)(=O)N1CCC2(CC2NS(=O)(=O)C(F)(F)F)CC1
Show InChI InChI=1S/C20H19ClF4N2O6S3/c21-13-5-6-16(17(11-13)34(28,29)15-4-2-1-3-14(15)22)35(30,31)27-9-7-19(8-10-27)12-18(19)26-36(32,33)20(23,24)25/h1-6,11,18,26H,7-10,12H2
Reactome pathway
1.70n/an/an/an/an/an/an/an/a
Universit£ degli Studi di Siena
Curated by ChEMBL
Assay Description
Displacement of [3H]CP 55940 from human CB2 receptor in cell free system
Eur J Med Chem 46: 547-55 (2011)
Article DOI: 10.1016/j.ejmech.2010.11.034
BindingDB Entry DOI: 10.7270/Q2CF9QCJ
Cannabinoid receptor 1
(Homo sapiens (Human))
BDBM50306016
(CHEMBL596579 | N-(6-(4-chloro-2-(2-fluorophenylsul...)
Show SMILES Fc1ccccc1S(=O)(=O)c1cc(Cl)ccc1S(=O)(=O)N1CCC2(CC2NS(=O)(=O)C(F)(F)F)CC1
Show InChI InChI=1S/C20H19ClF4N2O6S3/c21-13-5-6-16(17(11-13)34(28,29)15-4-2-1-3-14(15)22)35(30,31)27-9-7-19(8-10-27)12-18(19)26-36(32,33)20(23,24)25/h1-6,11,18,26H,7-10,12H2
NCI pathway
Reactome pathway
2.50E+3n/an/an/an/an/an/an/an/a
Merck Research Laboratories
Curated by ChEMBL
Assay Description
Binding affinity to human CB1 receptor
Bioorg Med Chem Lett 20: 608-11 (2010)
Article DOI: 10.1016/j.bmcl.2009.11.084
BindingDB Entry DOI: 10.7270/Q2SB45V0
Cannabinoid receptor 1
(Homo sapiens (Human))
BDBM50306016
(CHEMBL596579 | N-(6-(4-chloro-2-(2-fluorophenylsul...)
Show SMILES Fc1ccccc1S(=O)(=O)c1cc(Cl)ccc1S(=O)(=O)N1CCC2(CC2NS(=O)(=O)C(F)(F)F)CC1
Show InChI InChI=1S/C20H19ClF4N2O6S3/c21-13-5-6-16(17(11-13)34(28,29)15-4-2-1-3-14(15)22)35(30,31)27-9-7-19(8-10-27)12-18(19)26-36(32,33)20(23,24)25/h1-6,11,18,26H,7-10,12H2
NCI pathway
Reactome pathway
2.50E+3n/an/an/an/an/an/an/an/a
Universit£ degli Studi di Siena
Curated by ChEMBL
Assay Description
Displacement of [3H]CP 55940 from human CB1 receptor in cell free system
Eur J Med Chem 46: 547-55 (2011)
Article DOI: 10.1016/j.ejmech.2010.11.034
BindingDB Entry DOI: 10.7270/Q2CF9QCJ
Cytochrome P450 2C9
(Homo sapiens (Human))
BDBM50306016
(CHEMBL596579 | N-(6-(4-chloro-2-(2-fluorophenylsul...)
Show SMILES Fc1ccccc1S(=O)(=O)c1cc(Cl)ccc1S(=O)(=O)N1CCC2(CC2NS(=O)(=O)C(F)(F)F)CC1
Show InChI InChI=1S/C20H19ClF4N2O6S3/c21-13-5-6-16(17(11-13)34(28,29)15-4-2-1-3-14(15)22)35(30,31)27-9-7-19(8-10-27)12-18(19)26-36(32,33)20(23,24)25/h1-6,11,18,26H,7-10,12H2
Reactome pathway
n/an/a 2.00E+3n/an/an/an/an/an/a
Merck Research Laboratories
Curated by ChEMBL
Assay Description
Inhibition of CYP2C9
Bioorg Med Chem Lett 20: 608-11 (2010)
Article DOI: 10.1016/j.bmcl.2009.11.084
BindingDB Entry DOI: 10.7270/Q2SB45V0