null
SMILES: Cc1n[nH]c2ccc(cc12)-c1cc(OC[C@@H](N)Cc2ccccc2)cnc1-c1cc(F)ccc1O
InChI Key: InChIKey=GRMBXYBGEBAHFY-NRFANRHFSA-N
Activity Spreadsheet -- Enzyme Inhibition Constant Data from BindingDB
Found 2 hits for monomerid = 50306105
Trg + Lig
Ki
nM
ΔG°
kcal/mole
IC50
nM
Kd
nM
EC50/IC50
nM
koff
s-1
kon
M-1s-1
pHTemp
°C
RAC-alpha serine/threonine-protein kinase
(Homo sapiens (Human))
BDBM50306105
(2-(5-((S)-2-amino-3-phenylpropoxy)-3-(3-methyl-1H-...)
Show SMILES Cc1n[nH]c2ccc(cc12)-c1cc(OC[C@@H](N)Cc2ccccc2)cnc1-c1cc(F)ccc1O |r|
Show InChI InChI=1S/C28H25FN4O2/c1-17-23-12-19(7-9-26(23)33-32-17)24-14-22(35-16-21(30)11-18-5-3-2-4-6-18)15-31-28(24)25-13-20(29)8-10-27(25)34/h2-10,12-15,21,34H,11,16,30H2,1H3,(H,32,33)/t21-/m0/s1
n/an/a 10n/an/an/an/an/an/a
GlaxoSmithKline
Curated by ChEMBL
Assay Description
Inhibition of truncated AKT1
Bioorg Med Chem Lett 20: 673-8 (2010)
Article DOI: 10.1016/j.bmcl.2009.11.064
BindingDB Entry DOI: 10.7270/Q2D21XQ0
Rho-associated protein kinase 1
(Homo sapiens (Human))
BDBM50306105
(2-(5-((S)-2-amino-3-phenylpropoxy)-3-(3-methyl-1H-...)
Show SMILES Cc1n[nH]c2ccc(cc12)-c1cc(OC[C@@H](N)Cc2ccccc2)cnc1-c1cc(F)ccc1O |r|
Show InChI InChI=1S/C28H25FN4O2/c1-17-23-12-19(7-9-26(23)33-32-17)24-14-22(35-16-21(30)11-18-5-3-2-4-6-18)15-31-28(24)25-13-20(29)8-10-27(25)34/h2-10,12-15,21,34H,11,16,30H2,1H3,(H,32,33)/t21-/m0/s1
NCI pathway
Reactome pathway
n/an/a 9.80E+3n/an/an/an/an/an/a
GlaxoSmithKline
Curated by ChEMBL
Assay Description
Inhibition of ROCK1
Bioorg Med Chem Lett 20: 673-8 (2010)
Article DOI: 10.1016/j.bmcl.2009.11.064
BindingDB Entry DOI: 10.7270/Q2D21XQ0