null
SMILES: Cc1n[nH]c2ncc(nc12)-c1cc(OC[C@@H](N)Cc2c([nH]c3ccccc23)C#N)c(N)nc1-c1ccoc1C
InChI Key: InChIKey=AGYJPEBXFSGBHP-INIZCTEOSA-N
Activity Spreadsheet -- Enzyme Inhibition Constant Data from BindingDB
Found 5 hits for monomerid = 50306164
Trg + Lig
Ki
nM
ΔG°
kcal/mole
IC50
nM
Kd
nM
EC50/IC50
nM
koff
s-1
kon
M-1s-1
pHTemp
°C
RAC-alpha serine/threonine-protein kinase
(Homo sapiens (Human))
BDBM50306164
(3-((2S)-2-amino-3-(2-amino-5-(3-methyl-1H-pyrazolo...)
Show SMILES Cc1n[nH]c2ncc(nc12)-c1cc(OC[C@@H](N)Cc2c([nH]c3ccccc23)C#N)c(N)nc1-c1ccoc1C |r|
Show InChI InChI=1S/C28H25N9O2/c1-14-25-28(37-36-14)32-12-23(34-25)20-10-24(27(31)35-26(20)17-7-8-38-15(17)2)39-13-16(30)9-19-18-5-3-4-6-21(18)33-22(19)11-29/h3-8,10,12,16,33H,9,13,30H2,1-2H3,(H2,31,35)(H,32,36,37)/t16-/m0/s1
n/an/a 1n/an/an/an/an/an/a
GlaxoSmithKline
Curated by ChEMBL
Assay Description
Inhibition of human AKT1
Bioorg Med Chem Lett 20: 684-8 (2010)
Article DOI: 10.1016/j.bmcl.2009.11.061
BindingDB Entry DOI: 10.7270/Q20V8CXX
RAC-beta serine/threonine-protein kinase
(Homo sapiens (Human))
BDBM50306164
(3-((2S)-2-amino-3-(2-amino-5-(3-methyl-1H-pyrazolo...)
Show SMILES Cc1n[nH]c2ncc(nc12)-c1cc(OC[C@@H](N)Cc2c([nH]c3ccccc23)C#N)c(N)nc1-c1ccoc1C |r|
Show InChI InChI=1S/C28H25N9O2/c1-14-25-28(37-36-14)32-12-23(34-25)20-10-24(27(31)35-26(20)17-7-8-38-15(17)2)39-13-16(30)9-19-18-5-3-4-6-21(18)33-22(19)11-29/h3-8,10,12,16,33H,9,13,30H2,1-2H3,(H2,31,35)(H,32,36,37)/t16-/m0/s1
n/an/a 7n/an/an/an/an/an/a
GlaxoSmithKline
Curated by ChEMBL
Assay Description
Inhibition of human AKT2
Bioorg Med Chem Lett 20: 684-8 (2010)
Article DOI: 10.1016/j.bmcl.2009.11.061
BindingDB Entry DOI: 10.7270/Q20V8CXX
Cytochrome P450 3A4
(Homo sapiens (Human))
BDBM50306164
(3-((2S)-2-amino-3-(2-amino-5-(3-methyl-1H-pyrazolo...)
Show SMILES Cc1n[nH]c2ncc(nc12)-c1cc(OC[C@@H](N)Cc2c([nH]c3ccccc23)C#N)c(N)nc1-c1ccoc1C |r|
Show InChI InChI=1S/C28H25N9O2/c1-14-25-28(37-36-14)32-12-23(34-25)20-10-24(27(31)35-26(20)17-7-8-38-15(17)2)39-13-16(30)9-19-18-5-3-4-6-21(18)33-22(19)11-29/h3-8,10,12,16,33H,9,13,30H2,1-2H3,(H2,31,35)(H,32,36,37)/t16-/m0/s1
Reactome pathway
n/an/a 1.60E+3n/an/an/an/an/an/a
GlaxoSmithKline
Curated by ChEMBL
Assay Description
Inhibition of CYP3A4
Bioorg Med Chem Lett 20: 684-8 (2010)
Article DOI: 10.1016/j.bmcl.2009.11.061
BindingDB Entry DOI: 10.7270/Q20V8CXX
Glycogen synthase kinase-3 beta
(Homo sapiens (Human))
BDBM50306164
(3-((2S)-2-amino-3-(2-amino-5-(3-methyl-1H-pyrazolo...)
Show SMILES Cc1n[nH]c2ncc(nc12)-c1cc(OC[C@@H](N)Cc2c([nH]c3ccccc23)C#N)c(N)nc1-c1ccoc1C |r|
Show InChI InChI=1S/C28H25N9O2/c1-14-25-28(37-36-14)32-12-23(34-25)20-10-24(27(31)35-26(20)17-7-8-38-15(17)2)39-13-16(30)9-19-18-5-3-4-6-21(18)33-22(19)11-29/h3-8,10,12,16,33H,9,13,30H2,1-2H3,(H2,31,35)(H,32,36,37)/t16-/m0/s1
NCI pathway
Reactome pathway
n/an/a>3.00E+4n/an/an/an/an/an/a
GlaxoSmithKline
Curated by ChEMBL
Assay Description
Inhibition of GSK2beta phosphorylation in human BT474 cells
Bioorg Med Chem Lett 20: 684-8 (2010)
Article DOI: 10.1016/j.bmcl.2009.11.061
BindingDB Entry DOI: 10.7270/Q20V8CXX
RAC-gamma serine/threonine-protein kinase
(Homo sapiens (Human))
BDBM50306164
(3-((2S)-2-amino-3-(2-amino-5-(3-methyl-1H-pyrazolo...)
Show SMILES Cc1n[nH]c2ncc(nc12)-c1cc(OC[C@@H](N)Cc2c([nH]c3ccccc23)C#N)c(N)nc1-c1ccoc1C |r|
Show InChI InChI=1S/C28H25N9O2/c1-14-25-28(37-36-14)32-12-23(34-25)20-10-24(27(31)35-26(20)17-7-8-38-15(17)2)39-13-16(30)9-19-18-5-3-4-6-21(18)33-22(19)11-29/h3-8,10,12,16,33H,9,13,30H2,1-2H3,(H2,31,35)(H,32,36,37)/t16-/m0/s1
NCI pathway
Reactome pathway
n/an/a 1n/an/an/an/an/an/a
GlaxoSmithKline
Curated by ChEMBL
Assay Description
Inhibition of human AKT3
Bioorg Med Chem Lett 20: 684-8 (2010)
Article DOI: 10.1016/j.bmcl.2009.11.061
BindingDB Entry DOI: 10.7270/Q20V8CXX