BDBM50306187 2-(4-((methylamino)methyl)-3-(trifluoromethyl)phenyl)-2H-indazole-7-carboxamide::CHEMBL593610
SMILES: CNCc1ccc(cc1C(F)(F)F)-n1cc2cccc(C(N)=O)c2n1
InChI Key: InChIKey=KJEJGHQKAMFWRU-UHFFFAOYSA-N
Data: 1 IC50
Activity Spreadsheet -- Enzyme Inhibition Constant Data from BindingDB
Found 1 hit for monomerid = 50306187
Trg + Lig
Ki
nM
ΔG°
kcal/mole
IC50
nM
Kd
nM
EC50/IC50
nM
koff
s-1
kon
M-1s-1
pHTemp
°C
Poly [ADP-ribose] polymerase 1
(Homo sapiens (Human))
BDBM50306187
(2-(4-((methylamino)methyl)-3-(trifluoromethyl)phen...)
Show SMILES CNCc1ccc(cc1C(F)(F)F)-n1cc2cccc(C(N)=O)c2n1
Show InChI InChI=1S/C17H15F3N4O/c1-22-8-10-5-6-12(7-14(10)17(18,19)20)24-9-11-3-2-4-13(16(21)25)15(11)23-24/h2-7,9,22H,8H2,1H3,(H2,21,25)
n/an/a 5n/an/an/an/an/an/a
IRBM-Merck Research Laboratories Rome
Curated by ChEMBL
Assay Description
Inhibition of human PARP1 after 3 hrs using [3H]NAD+ by scintillation proximity assay
Bioorg Med Chem Lett 20: 488-92 (2010)
Article DOI: 10.1016/j.bmcl.2009.11.127
BindingDB Entry DOI: 10.7270/Q2W37WFZ