BDBM50306193 (S)-2-(4-(1-methylpyrrolidine-2-carboxamido)phenyl)-2H-indazole-7-carboxamide::CHEMBL596365
SMILES: CN1CCC[C@H]1C(=O)Nc1ccc(cc1)-n1cc2cccc(C(N)=O)c2n1
InChI Key: InChIKey=MUALPBWISBWOSS-KRWDZBQOSA-N
Data: 1 IC50
Activity Spreadsheet -- Enzyme Inhibition Constant Data from BindingDB
Found 1 hit for monomerid = 50306193
Trg + Lig
Ki
nM
ΔG°
kcal/mole
IC50
nM
Kd
nM
EC50/IC50
nM
koff
s-1
kon
M-1s-1
pHTemp
°C
Poly [ADP-ribose] polymerase 1
(Homo sapiens (Human))
BDBM50306193
((S)-2-(4-(1-methylpyrrolidine-2-carboxamido)phenyl...)
Show SMILES CN1CCC[C@H]1C(=O)Nc1ccc(cc1)-n1cc2cccc(C(N)=O)c2n1 |r|
Show InChI InChI=1S/C20H21N5O2/c1-24-11-3-6-17(24)20(27)22-14-7-9-15(10-8-14)25-12-13-4-2-5-16(19(21)26)18(13)23-25/h2,4-5,7-10,12,17H,3,6,11H2,1H3,(H2,21,26)(H,22,27)/t17-/m0/s1
n/an/a 17n/an/an/an/an/an/a
IRBM-Merck Research Laboratories Rome
Curated by ChEMBL
Assay Description
Inhibition of human PARP1 after 3 hrs using [3H]NAD+ by scintillation proximity assay
Bioorg Med Chem Lett 20: 488-92 (2010)
Article DOI: 10.1016/j.bmcl.2009.11.127
BindingDB Entry DOI: 10.7270/Q2W37WFZ