BDBM50306246 1-(2-(3-methoxyphenyl)acetyl)-2,3,9,9a-tetrahydro-1H-benzo[de][1,7]naphthyridin-7(8H)-one::CHEMBL595236
SMILES: COc1cccc(CC(=O)N2CCc3cccc4C(=O)NCC2c34)c1
InChI Key: InChIKey=DCGBIYGHABWOMG-UHFFFAOYSA-N
Data: 1 IC50  1 EC50
Activity Spreadsheet -- Enzyme Inhibition Constant Data from BindingDB
Found 2 hits for monomerid = 50306246
Trg + Lig
Ki
nM
ΔG°
kcal/mole
IC50
nM
Kd
nM
EC50/IC50
nM
koff
s-1
kon
M-1s-1
pHTemp
°C
Poly [ADP-ribose] polymerase 1
(Homo sapiens (Human))
BDBM50306246
(1-(2-(3-methoxyphenyl)acetyl)-2,3,9,9a-tetrahydro-...)
Show SMILES COc1cccc(CC(=O)N2CCc3cccc4C(=O)NCC2c34)c1
Show InChI InChI=1S/C20H20N2O3/c1-25-15-6-2-4-13(10-15)11-18(23)22-9-8-14-5-3-7-16-19(14)17(22)12-21-20(16)24/h2-7,10,17H,8-9,11-12H2,1H3,(H,21,24)
n/an/an/an/a 1.20E+3n/an/an/an/a
IRBM-Merck Research Laboratories Rome
Curated by ChEMBL
Assay Description
Inhibition of PARP1 in human HeLa cells assessed as inhibition of hydrogen peroxide-induced poly(ADP-ribosyl)ation
Bioorg Med Chem Lett 20: 448-52 (2010)
Article DOI: 10.1016/j.bmcl.2009.12.002
BindingDB Entry DOI: 10.7270/Q2GT5N91
Poly [ADP-ribose] polymerase 1
(Homo sapiens (Human))
BDBM50306246
(1-(2-(3-methoxyphenyl)acetyl)-2,3,9,9a-tetrahydro-...)
Show SMILES COc1cccc(CC(=O)N2CCc3cccc4C(=O)NCC2c34)c1
Show InChI InChI=1S/C20H20N2O3/c1-25-15-6-2-4-13(10-15)11-18(23)22-9-8-14-5-3-7-16-19(14)17(22)12-21-20(16)24/h2-7,10,17H,8-9,11-12H2,1H3,(H,21,24)
n/an/a 5n/an/an/an/an/an/a
IRBM-Merck Research Laboratories Rome
Curated by ChEMBL
Assay Description
Inhibition of human PARP1 by scintillation proximity assay
Bioorg Med Chem Lett 20: 448-52 (2010)
Article DOI: 10.1016/j.bmcl.2009.12.002
BindingDB Entry DOI: 10.7270/Q2GT5N91