BDBM50306285 2,3-dihydro-1H-benzo[de]isoquinolin-1-one::CHEMBL594596
SMILES: O=C1NCc2cccc3cccc1c23
InChI Key: InChIKey=QGJHNXPHHOCUAH-UHFFFAOYSA-N
Data: 1 IC50
Activity Spreadsheet -- Enzyme Inhibition Constant Data from BindingDB
Found 1 hit for monomerid = 50306285
Trg + Lig
Ki
nM
ΔG°
kcal/mole
IC50
nM
Kd
nM
EC50/IC50
nM
koff
s-1
kon
M-1s-1
pHTemp
°C
Poly [ADP-ribose] polymerase 1
(Homo sapiens (Human))
BDBM50306285
(2,3-dihydro-1H-benzo[de]isoquinolin-1-one | CHEMBL...)
Show SMILES O=C1NCc2cccc3cccc1c23
Show InChI InChI=1S/C12H9NO/c14-12-10-6-2-4-8-3-1-5-9(7-13-12)11(8)10/h1-6H,7H2,(H,13,14)
n/an/a 540n/an/an/an/an/an/a
IRBM-Merck Research Laboratories Rome
Curated by ChEMBL
Assay Description
Inhibition of human PARP1 by scintillation proximity assay
Bioorg Med Chem Lett 20: 448-52 (2010)
Article DOI: 10.1016/j.bmcl.2009.12.002
BindingDB Entry DOI: 10.7270/Q2GT5N91