BDBM50306303 (S)-N-(1-cyanocyclopropyl)-2-((S)-1-(4'-((S)-2,2-difluoro-1-hydroxyethyl)biphenyl-4-yl)-2,2,2-trifluoroethylamino)-4-fluoro-4-methylpentanamide::CHEMBL599272
SMILES: CC(C)(F)C[C@H](N[C@@H](c1ccc(cc1)-c1ccc(cc1)[C@H](O)C(F)F)C(F)(F)F)C(=O)NC1(CC1)C#N
InChI Key: InChIKey=YTEORGORWDMMRK-ACRUOGEOSA-N
Data: 1 IC50
Activity Spreadsheet -- Enzyme Inhibition Constant Data from BindingDB
Found 1 hit for monomerid = 50306303
Trg + Lig
Ki
nM
ΔG°
kcal/mole
IC50
nM
Kd
nM
EC50/IC50
nM
koff
s-1
kon
M-1s-1
pHTemp
°C
Cathepsin K
(Homo sapiens (Human))
BDBM50306303
((S)-N-(1-cyanocyclopropyl)-2-((S)-1-(4'-((S)-2,2-d...)
Show SMILES CC(C)(F)C[C@H](N[C@@H](c1ccc(cc1)-c1ccc(cc1)[C@H](O)C(F)F)C(F)(F)F)C(=O)NC1(CC1)C#N |r|
Show InChI InChI=1S/C26H27F6N3O2/c1-24(2,29)13-19(23(37)35-25(14-33)11-12-25)34-21(26(30,31)32)18-9-5-16(6-10-18)15-3-7-17(8-4-15)20(36)22(27)28/h3-10,19-22,34,36H,11-13H2,1-2H3,(H,35,37)/t19-,20-,21-/m0/s1
Reactome pathway
n/an/a 0.400n/an/an/an/an/an/a
Merck Frosst Centre for Therapeutic Research
Curated by ChEMBL
Assay Description
Inhibition of humanized rabbit cathepsin K
Bioorg Med Chem Lett 20: 887-92 (2010)
Article DOI: 10.1016/j.bmcl.2009.12.083
BindingDB Entry DOI: 10.7270/Q27D2V75