BDBM50306584 (R)-2-(carboxyformamido)-3-(4-(2-nitrobenzyloxy)phenyl)propanoic acid::CHEMBL602673
SMILES: OC(=O)[C@@H](Cc1ccc(OCc2ccccc2[N+]([O-])=O)cc1)NC(=O)C(O)=O
InChI Key: InChIKey=XILIMABFMQTKBZ-CQSZACIVSA-N
Data: 1 IC50
Activity Spreadsheet -- Enzyme Inhibition Constant Data from BindingDB
Found 1 hit for monomerid = 50306584
Trg + Lig
Ki
nM
ΔG°
kcal/mole
IC50
nM
Kd
nM
EC50/IC50
nM
koff
s-1
kon
M-1s-1
pHTemp
°C
Lysine-specific demethylase 4A (KDM4A)
(Homo sapiens (Human))
BDBM50306584
((R)-2-(carboxyformamido)-3-(4-(2-nitrobenzyloxy)ph...)
Show SMILES OC(=O)[C@@H](Cc1ccc(OCc2ccccc2[N+]([O-])=O)cc1)NC(=O)C(O)=O |r|
Show InChI InChI=1S/C18H16N2O8/c21-16(18(24)25)19-14(17(22)23)9-11-5-7-13(8-6-11)28-10-12-3-1-2-4-15(12)20(26)27/h1-8,14H,9-10H2,(H,19,21)(H,22,23)(H,24,25)/t14-/m1/s1
n/an/a 1.70E+4n/an/an/an/an/an/a
University of Oxford
Curated by ChEMBL
Assay Description
Inhibition of JMJD2A by MALDI-TOF assay
J Med Chem 53: 1810-8 (2010)
Article DOI: 10.1021/jm901680b
BindingDB Entry DOI: 10.7270/Q2959HPQ