null
SMILES: COc1cccc2c1c(OC)c([N+]([O-])=O)c1c(cc3OCOc3c21)C(O)=O
InChI Key: InChIKey=LUTVDEQKDLXTSW-UHFFFAOYSA-N
Activity Spreadsheet -- Enzyme Inhibition Constant Data from BindingDB
Found 1 hit for monomerid = 50306856
Trg + Lig
Ki
nM
ΔG°
kcal/mole
IC50
nM
Kd
nM
EC50/IC50
nM
koff
s-1
kon
M-1s-1
pHTemp
°C
Cyclin-dependent kinase 2
(Homo sapiens (Human))
BDBM50306856
(7-methoxy aristolochic acid A | CHEMBL601663)
Show SMILES COc1cccc2c1c(OC)c([N+]([O-])=O)c1c(cc3OCOc3c21)C(O)=O
Show InChI InChI=1S/C18H13NO8/c1-24-10-5-3-4-8-12(10)17(25-2)15(19(22)23)13-9(18(20)21)6-11-16(14(8)13)27-7-26-11/h3-6H,7H2,1-2H3,(H,20,21)
NCI pathway
Reactome pathway
n/an/a>2.00E+4n/an/an/an/an/an/a
Schering Plough Research Institute
Curated by ChEMBL
Assay Description
Inhibition of CDK2
Bioorg Med Chem Lett 20: 1384-7 (2010)
Article DOI: 10.1016/j.bmcl.2010.01.007
BindingDB Entry DOI: 10.7270/Q2QF8TTB