BDBM50306863 3,4-dihydroxy-10-nitrophenanthrene-1-carboxylic acid::CHEMBL600386
SMILES: OC(=O)c1cc(O)c(O)c2c1c(cc1ccccc21)[N+]([O-])=O
InChI Key: InChIKey=LTJQUBUPNMQGJL-UHFFFAOYSA-N
Data: 1 IC50
Activity Spreadsheet -- Enzyme Inhibition Constant Data from BindingDB
Found 1 hit for monomerid = 50306863
Trg + Lig
Ki
nM
ΔG°
kcal/mole
IC50
nM
Kd
nM
EC50/IC50
nM
koff
s-1
kon
M-1s-1
pHTemp
°C
Cyclin-dependent kinase 2
(Homo sapiens (Human))
BDBM50306863
(3,4-dihydroxy-10-nitrophenanthrene-1-carboxylic ac...)
Show SMILES OC(=O)c1cc(O)c(O)c2c1c(cc1ccccc21)[N+]([O-])=O
Show InChI InChI=1S/C15H9NO6/c17-11-6-9(15(19)20)12-10(16(21)22)5-7-3-1-2-4-8(7)13(12)14(11)18/h1-6,17-18H,(H,19,20)
NCI pathway
Reactome pathway
n/an/a 1.34E+4n/an/an/an/an/an/a
Schering Plough Research Institute
Curated by ChEMBL
Assay Description
Inhibition of CDK2
Bioorg Med Chem Lett 20: 1384-7 (2010)
Article DOI: 10.1016/j.bmcl.2010.01.007
BindingDB Entry DOI: 10.7270/Q2QF8TTB