BDBM50307084 4-Nitrophenyl 4-((5-Phenylfuran-2-yl)methyl)piperazine-1-carboxylate::CHEMBL601244
SMILES: [O-][N+](=O)c1ccc(OC(=O)N2CCN(Cc3ccc(o3)-c3ccccc3)CC2)cc1
InChI Key: InChIKey=RHTPEZUUFRCUSM-UHFFFAOYSA-N
Data: 3 IC50
Activity Spreadsheet -- Enzyme Inhibition Constant Data from BindingDB
Found 3 hits for monomerid = 50307084
Trg + Lig
Ki
nM
ΔG°
kcal/mole
IC50
nM
Kd
nM
EC50/IC50
nM
koff
s-1
kon
M-1s-1
pHTemp
°C
Anandamide amidohydrolase
(Mus musculus (mouse))
BDBM50307084
(4-Nitrophenyl 4-((5-Phenylfuran-2-yl)methyl)pipera...)
Show SMILES [O-][N+](=O)c1ccc(OC(=O)N2CCN(Cc3ccc(o3)-c3ccccc3)CC2)cc1
Show InChI InChI=1S/C22H21N3O5/c26-22(30-19-8-6-18(7-9-19)25(27)28)24-14-12-23(13-15-24)16-20-10-11-21(29-20)17-4-2-1-3-5-17/h1-11H,12-16H2
n/an/a 20n/an/an/an/an/an/a
The Scripps Research Institute
Curated by ChEMBL
Assay Description
Inhibition of FAAH in mouse brain membrane
J Med Chem 53: 1830-42 (2010)
Article DOI: 10.1021/jm9016976
BindingDB Entry DOI: 10.7270/Q2KH0NFR
Abhydrolase Domain-Containing Protein 6
(Mus musculus (mouse))
BDBM50307084
(4-Nitrophenyl 4-((5-Phenylfuran-2-yl)methyl)pipera...)
Show SMILES [O-][N+](=O)c1ccc(OC(=O)N2CCN(Cc3ccc(o3)-c3ccccc3)CC2)cc1
Show InChI InChI=1S/C22H21N3O5/c26-22(30-19-8-6-18(7-9-19)25(27)28)24-14-12-23(13-15-24)16-20-10-11-21(29-20)17-4-2-1-3-5-17/h1-11H,12-16H2
n/an/a 220n/an/an/an/an/an/a
The Scripps Research Institute
Curated by ChEMBL
Assay Description
Inhibition of ABHD6 in mouse brain membrane
J Med Chem 53: 1830-42 (2010)
Article DOI: 10.1021/jm9016976
BindingDB Entry DOI: 10.7270/Q2KH0NFR
Monoglyceride Lipase (MGL)
(Mus musculus (mouse))
BDBM50307084
(4-Nitrophenyl 4-((5-Phenylfuran-2-yl)methyl)pipera...)
Show SMILES [O-][N+](=O)c1ccc(OC(=O)N2CCN(Cc3ccc(o3)-c3ccccc3)CC2)cc1
Show InChI InChI=1S/C22H21N3O5/c26-22(30-19-8-6-18(7-9-19)25(27)28)24-14-12-23(13-15-24)16-20-10-11-21(29-20)17-4-2-1-3-5-17/h1-11H,12-16H2
Reactome pathway
n/an/a 90n/an/an/an/an/an/a
The Scripps Research Institute
Curated by ChEMBL
Assay Description
Inhibition of MAGL in mouse brain membrane
J Med Chem 53: 1830-42 (2010)
Article DOI: 10.1021/jm9016976
BindingDB Entry DOI: 10.7270/Q2KH0NFR