BDBM50307409 3-(2-(3-methyl-1-phenylbutylcarbamoyl)-4-(phenoxymethyl)phenyl)propanoic acid::3-[2-{[(3-Methyl-1-phenylbutyl)amino]carbonyl}-4-(phenoxymethyl)phenyl]propanoic acid::CHEMBL602337
SMILES: CC(C)CC(NC(=O)c1cc(COc2ccccc2)ccc1CCC(O)=O)c1ccccc1
InChI Key: InChIKey=HSHFSMZZWDOMPK-UHFFFAOYSA-N
Data: 5 KI  2 IC50
Activity Spreadsheet -- Enzyme Inhibition Constant Data from BindingDB
Found 7 hits for monomerid = 50307409
Trg + Lig
Ki
nM
ΔG°
kcal/mole
IC50
nM
Kd
nM
EC50/IC50
nM
koff
s-1
kon
M-1s-1
pHTemp
°C
Prostanoid EP3 Receptor
(Mus musculus (Mouse))
BDBM50307409
(3-(2-(3-methyl-1-phenylbutylcarbamoyl)-4-(phenoxym...)
Show SMILES CC(C)CC(NC(=O)c1cc(COc2ccccc2)ccc1CCC(O)=O)c1ccccc1
Show InChI InChI=1S/C28H31NO4/c1-20(2)17-26(23-9-5-3-6-10-23)29-28(32)25-18-21(13-14-22(25)15-16-27(30)31)19-33-24-11-7-4-8-12-24/h3-14,18,20,26H,15-17,19H2,1-2H3,(H,29,32)(H,30,31)
0.700n/an/an/an/an/an/an/an/a
Minase Research Institute
Curated by ChEMBL
Assay Description
Displacement of [3H]PGE3alpha from mouse EP3alpha receptor expressed in CHO cells by liquid scintillation counting
Bioorg Med Chem 18: 80-90 (2010)
Article DOI: 10.1016/j.bmc.2009.11.023
BindingDB Entry DOI: 10.7270/Q24X57X2
Prostanoid EP3 Receptor
(Mus musculus (Mouse))
BDBM50307409
(3-(2-(3-methyl-1-phenylbutylcarbamoyl)-4-(phenoxym...)
Show SMILES CC(C)CC(NC(=O)c1cc(COc2ccccc2)ccc1CCC(O)=O)c1ccccc1
Show InChI InChI=1S/C28H31NO4/c1-20(2)17-26(23-9-5-3-6-10-23)29-28(32)25-18-21(13-14-22(25)15-16-27(30)31)19-33-24-11-7-4-8-12-24/h3-14,18,20,26H,15-17,19H2,1-2H3,(H,29,32)(H,30,31)
0.700n/an/an/an/an/an/an/an/a
Minase Research Institute
Curated by ChEMBL
Assay Description
Displacement of [3H]PGE2 from mouse EP3 receptor expressed in CHO cell membrane
Bioorg Med Chem 18: 1641-58 (2010)
Article DOI: 10.1016/j.bmc.2009.12.068
BindingDB Entry DOI: 10.7270/Q29023W2
Prostanoid EP4 Receptor
(Mus musculus (Mouse))
BDBM50307409
(3-(2-(3-methyl-1-phenylbutylcarbamoyl)-4-(phenoxym...)
Show SMILES CC(C)CC(NC(=O)c1cc(COc2ccccc2)ccc1CCC(O)=O)c1ccccc1
Show InChI InChI=1S/C28H31NO4/c1-20(2)17-26(23-9-5-3-6-10-23)29-28(32)25-18-21(13-14-22(25)15-16-27(30)31)19-33-24-11-7-4-8-12-24/h3-14,18,20,26H,15-17,19H2,1-2H3,(H,29,32)(H,30,31)
Reactome pathway
1.60E+3n/an/an/an/an/an/an/an/a
Minase Research Institute
Curated by ChEMBL
Assay Description
Displacement of [3H]PGE3 from mouse EP4 receptor expressed in CHO cells by liquid scintillation counting
Bioorg Med Chem 18: 80-90 (2010)
Article DOI: 10.1016/j.bmc.2009.11.023
BindingDB Entry DOI: 10.7270/Q24X57X2
Prostanoid EP1 Receptor
(Mus musculus (Mouse))
BDBM50307409
(3-(2-(3-methyl-1-phenylbutylcarbamoyl)-4-(phenoxym...)
Show SMILES CC(C)CC(NC(=O)c1cc(COc2ccccc2)ccc1CCC(O)=O)c1ccccc1
Show InChI InChI=1S/C28H31NO4/c1-20(2)17-26(23-9-5-3-6-10-23)29-28(32)25-18-21(13-14-22(25)15-16-27(30)31)19-33-24-11-7-4-8-12-24/h3-14,18,20,26H,15-17,19H2,1-2H3,(H,29,32)(H,30,31)
Reactome pathway
>1.00E+4n/an/an/an/an/an/an/an/a
Minase Research Institute
Curated by ChEMBL
Assay Description
Displacement of [3H]PGE2 from mouse EP1 receptor expressed in CHO cells by liquid scintillation counting
Bioorg Med Chem 18: 80-90 (2010)
Article DOI: 10.1016/j.bmc.2009.11.023
BindingDB Entry DOI: 10.7270/Q24X57X2
Prostanoid EP2 Receptor
(Mus musculus (Mouse))
BDBM50307409
(3-(2-(3-methyl-1-phenylbutylcarbamoyl)-4-(phenoxym...)
Show SMILES CC(C)CC(NC(=O)c1cc(COc2ccccc2)ccc1CCC(O)=O)c1ccccc1
Show InChI InChI=1S/C28H31NO4/c1-20(2)17-26(23-9-5-3-6-10-23)29-28(32)25-18-21(13-14-22(25)15-16-27(30)31)19-33-24-11-7-4-8-12-24/h3-14,18,20,26H,15-17,19H2,1-2H3,(H,29,32)(H,30,31)
Reactome pathway
>1.00E+4n/an/an/an/an/an/an/an/a
Minase Research Institute
Curated by ChEMBL
Assay Description
Displacement of [3H]PGE2 from mouse EP2 receptor expressed in CHO cells by liquid scintillation counting
Bioorg Med Chem 18: 80-90 (2010)
Article DOI: 10.1016/j.bmc.2009.11.023
BindingDB Entry DOI: 10.7270/Q24X57X2
Prostanoid EP3 Receptor
(Mus musculus (Mouse))
BDBM50307409
(3-(2-(3-methyl-1-phenylbutylcarbamoyl)-4-(phenoxym...)
Show SMILES CC(C)CC(NC(=O)c1cc(COc2ccccc2)ccc1CCC(O)=O)c1ccccc1
Show InChI InChI=1S/C28H31NO4/c1-20(2)17-26(23-9-5-3-6-10-23)29-28(32)25-18-21(13-14-22(25)15-16-27(30)31)19-33-24-11-7-4-8-12-24/h3-14,18,20,26H,15-17,19H2,1-2H3,(H,29,32)(H,30,31)
n/an/a 68n/an/an/an/an/an/a
Minase Research Institute
Curated by ChEMBL
Assay Description
Antagonist activity at mouse EP3 receptor expressed in CHO cells assessed as inhibition of PGE2-induced increase intracellular calcium level in prese...
Bioorg Med Chem 18: 1641-58 (2010)
Article DOI: 10.1016/j.bmc.2009.12.068
BindingDB Entry DOI: 10.7270/Q29023W2
Prostanoid EP3 Receptor
(Mus musculus (Mouse))
BDBM50307409
(3-(2-(3-methyl-1-phenylbutylcarbamoyl)-4-(phenoxym...)
Show SMILES CC(C)CC(NC(=O)c1cc(COc2ccccc2)ccc1CCC(O)=O)c1ccccc1
Show InChI InChI=1S/C28H31NO4/c1-20(2)17-26(23-9-5-3-6-10-23)29-28(32)25-18-21(13-14-22(25)15-16-27(30)31)19-33-24-11-7-4-8-12-24/h3-14,18,20,26H,15-17,19H2,1-2H3,(H,29,32)(H,30,31)
n/an/a 68n/an/an/an/an/an/a
Minase Research Institute
Curated by ChEMBL
Assay Description
Antagonist activity at mouse EP3alpha receptor expressed in CHO cells assessed as inhibition of PGE2-induced increase in intracellular calcium level ...
Bioorg Med Chem 18: 80-90 (2010)
Article DOI: 10.1016/j.bmc.2009.11.023
BindingDB Entry DOI: 10.7270/Q24X57X2